program: Gaussian 09
title: 000033074
version: EM64L-G09RevD.01
frameworkgroup: C1[X(C13H16N2O3)]
method: RPBEPBE
basis: SDD
operation: Freq
keyword: #p
keyword: freq=noraman
keyword: PBEPBE/SDD
title: #p freq=noraman PBEPBE/SDD
converged: YES YES NO NO
title: Mulliken charges:
elementType: O O O N N C C C C C C C C C C C C C H H H H H H H H H H H H H H H H
charge: -0.245580 -0.258311 -0.255906 -0.114586 0.016810 -0.336422 -0.344544 -0.300260 -0.312090 -0.361038 0.275365 0.069086 -0.319426 -0.335185 0.324416 -0.363542 -0.360440 -0.536947 0.235197 0.229028 0.241254 0.227894 0.225351 0.201666 0.200552 0.229181 0.223593 0.283528 0.280574 0.236255 0.251657 0.223014 0.222946 0.246908
chargesum: 0.00000
title: Mulliken charges with hydrogens summed into heavy atoms:
elementType: O O O N N C C C C C C C C C C C C C
charge: -0.245580 -0.258311 -0.255906 -0.114586 0.016810 0.127802 0.124604 0.126758 0.117644 -0.137445 0.275365 0.069086 -0.035897 -0.054612 0.324416 -0.127287 -0.108783 0.155921
polarizability: 2.81905967e+02 -3.40082004e+00 1.94264006e+02 1.38323638e+00 9.64405887e-01 8.85423453e+01
1716.lowfreq: -12.9254 -8.1122 -4.4757 -0.0006 0.0004 0.0005 11.1875 30.8399 46.9599
frequency: 9.2546 30.7834 46.9587 59.3295 74.8287 133.4924 141.1236 164.6096 192.2173 207.5091 223.8710 249.3686 257.8316 294.1349 315.9711 351.2595 373.4533 387.0877 415.8168 453.8579 460.3513 476.0343 506.1788 543.7503 583.6307 620.3858 640.5909 676.9221 701.7428 760.8760 766.5011 797.0878 807.9549 824.2108 833.3764 857.0356 898.7552 916.3178 979.5415 984.1867 992.5450 1000.0203 1001.5415 1011.5115 1051.2118 1075.8107 1081.6013 1097.8870 1109.9549 1111.1222 1144.8851 1154.6192 1176.1104 1181.1386 1191.7766 1232.2173 1258.4635 1276.4194 1291.2399 1297.8020 1306.0109 1331.1107 1342.2285 1357.1275 1363.1877 1373.2896 1378.0410 1426.7092 1435.0172 1448.3044 1450.1132 1454.3705 1459.3264 1466.8280 1472.4478 1495.6789 1501.1029 1538.9392 1576.4786 1616.6036 2948.6352 2952.5939 2959.7133 2962.8591 2965.0725 3049.9939 3052.4168 3059.0797 3081.7555 3089.7695 3094.0552 3127.5180 3150.4029 3152.0563 3170.4598 3178.6157
redmass: 3.2854 3.9129 4.8097 5.2746 4.0632 4.9404 4.6245 4.0120 5.2466 2.0480 1.1900 2.8179 3.7697 3.5143 6.7756 4.9657 2.3838 3.6962 3.0093 6.4101 2.9196 4.3056 2.9489 4.9953 3.6021 3.9557 4.2866 3.6982 4.2701 4.0614 4.8915 4.9434 3.8848 1.2977 1.6296 1.5981 1.6383 2.3134 1.3678 7.8743 2.7626 1.3526 2.7838 2.3827 1.9141 3.4252 4.0049 2.2381 1.3360 1.2601 2.2344 1.3467 2.1385 1.4809 1.0684 3.1255 1.5104 1.3164 1.6922 1.2898 1.8352 1.2768 1.2862 1.4287 2.0874 2.6011 1.8423 4.1509 1.1922 1.0801 1.0839 1.0999 1.0983 1.0504 1.0801 2.5143 8.0469 5.4550 7.4259 6.3494 1.0687 1.0698 1.0653 1.0328 1.0656 1.0918 1.1040 1.0892 1.0935 1.0963 1.0980 1.0996 1.0879 1.0885 1.0966 1.0953
irintensity: 1.1385 0.0763 2.2743 1.6863 0.3987 5.9288 1.5519 4.8713 1.0781 6.1258 0.5583 31.5282 10.3176 2.8085 0.6615 1.1146 8.9922 21.7131 0.1239 2.1383 0.7880 3.8863 10.7638 18.6289 16.2919 33.1020 27.1774 9.5045 15.8418 5.0745 6.0556 48.7798 13.1855 11.2555 8.7551 76.2230 24.9363 4.4436 1.0065 61.5366 102.4943 0.6494 2.9118 17.9141 19.0688 21.9655 96.2003 43.8667 13.5549 0.2158 206.1295 3.0646 88.6211 64.8197 0.3204 164.3860 6.8280 4.9382 74.0613 33.5732 322.7510 26.7971 12.0592 15.5754 27.4929 5.4885 18.1969 53.2062 3.2001 10.7688 1.1945 60.3267 6.4572 13.6699 42.4968 63.5540 153.4835 266.4598 68.5528 180.4302 43.5858 39.5020 25.4248 68.7396 109.9846 19.8321 46.8752 43.8344 17.6392 28.4862 34.6151 26.2187 0.5604 7.5494 8.2725 19.0761
temp: 298.150 k
press: 1.00000 atm
elementType: 8 8 8 7 7 6 6 6 6 6 6 6 6 6 6 6 6 6 1 1 1 1 1 1 1 1 1 1 1 1 1 1 1 1
symmnumber: 1
zpe: 715031.8 jmol-1
zpe.correction: 0.272341 hartree
zpe.thermalcorrener: 0.289294 hartree
zpe.thermalcorrenthalpy: 0.290238 hartree
zpe.thermalcorrgfe: 0.224941 hartree
zpe.sumelectzpe: -838.741371 hartree
zpe.sumelectthermal: -838.724418 hartree
zpe.sumelectthermalent: -838.723474 hartree
zpe.sumelectthermalfe: -838.788771 hartree
dipole: -2.1470 -5.2149 0.4127
dipole: 5.6546
quadrupole: -99.2150 -104.6211 -107.8560
quadrupole: -16.5619 -2.7797 -0.2930
quadrupole: 4.6823 -0.7237 -3.9586 -16.5619 -2.7797 -0.2930
hfenergy: -839.013712 hartree
pointgroup: C01 [X(C13H16N2O3)]
dipole: 0.9626095 1.3477306 1.4853695 debye
polarizability: 280.3119801|3.9219605|142.7600943|-15.4741371|52.683833|141.6402445 unknown
InChI: InChI=1S/C13H16N2O3/c1-17-12-4-2-11(3-5-12)13(16)10-14-15-6-8-18-9-7-15/h2-5,10H,6-9H2,1H3
charge 0 multiplicity 1
34 atoms
O  5.479006 1.146497 0.084784
O  -5.096873 0.903767 1.0057
O  -0.643085 -2.108336 -2.453488
N  2.760177 0.339811 -0.355394
N  1.428733 0.093262 -0.530452
C  3.063801 1.635869 0.289363
C  3.839641 -0.243113 -1.190913
C  4.416675 1.565404 1.015021
C  5.177765 -0.197418 -0.423318
C  0.999541 -0.842718 -1.367722
C  -1.579215 -0.58501 -0.838648
C  -0.426145 -1.201176 -1.571372
C  -1.464952 0.400491 0.17766
C  -2.885384 -1.036398 -1.197335
C  -3.895236 0.459484 0.44263
C  -2.608612 0.922477 0.817868
C  -4.028723 -0.526141 -0.571483
C  -5.024072 1.92194 2.057739
H  2.244128 1.859391 0.992241
H  3.099006 2.440659 -0.475935
H  3.919088 0.310186 -2.151574
H  3.604171 -1.298008 -1.418535
H  4.715478 2.559455 1.383905
H  4.359436 0.852655 1.865666
H  5.144519 -0.919327 0.421076
H  6.011379 -0.457935 -1.095206
H  1.662022 -1.446061 -2.010222
H  -0.471767 0.755349 0.46058
H  -2.964665 -1.797491 -1.980304
H  -2.487441 1.679949 1.598165
H  -5.032563 -0.867007 -0.842184
H  -4.562722 2.855492 1.68175
H  -4.457415 1.553277 2.934527
H  -6.068495 2.113025 2.344113
