program: Gaussian 09
title: 000033047
version: EM64L-G09RevD.01
frameworkgroup: C1[X(C11H16)]
method: RPBEPBE
basis: SDD
operation: Freq
keyword: #p
keyword: freq=noraman
keyword: PBEPBE/SDD
title: #p freq=noraman PBEPBE/SDD
converged: YES YES NO NO
title: Mulliken charges:
elementType: C C C C C C C C C C C H H H H H H H H H H H H H H H H
charge: 0.358735 0.351362 -0.565699 -0.559910 -0.573242 0.450217 -0.400612 -0.417985 -0.681177 -0.679667 -0.814537 0.213794 0.213287 0.212975 0.212286 0.232855 0.227396 0.226852 0.218264 0.215422 0.224718 0.217664 0.214917 0.224376 0.223172 0.232484 0.222051
chargesum: 0.00000
title: Mulliken charges with hydrogens summed into heavy atoms:
elementType: C C C C C C C C C C C
charge: 0.358735 0.351362 -0.138617 -0.134649 -0.340387 0.450217 -0.173216 -0.191132 -0.022773 -0.022711 -0.136829
polarizability: 1.49270764e+02 3.96474117e-01 1.23233803e+02 -1.13090327e+00 1.02814256e+01 7.94119988e+01
1716.lowfreq: -2.3269 -0.0008 -0.0005 -0.0005 9.2210 12.6917 39.7545 72.2821 79.2983
frequency: 39.2726 72.1414 79.2714 96.7387 129.4028 205.0999 212.8946 216.3217 280.6352 290.7893 336.4550 373.9009 427.1095 457.7335 508.8311 548.6315 600.1521 701.9096 713.8152 764.4745 786.0874 792.2601 828.9922 894.5974 900.4495 957.1379 966.5706 976.3881 998.8142 1044.7609 1046.7344 1054.8389 1057.2037 1068.1237 1136.4919 1167.7420 1212.6307 1236.3688 1247.0764 1262.8985 1300.0559 1311.8916 1315.8507 1375.4775 1386.4752 1387.8810 1395.9419 1410.7689 1467.2758 1471.7675 1472.7055 1473.8562 1474.0189 1480.8413 1489.2444 1497.8145 1501.9015 1584.5967 1623.0612 2971.6892 2976.5976 2977.1243 2990.2524 2992.4763 3037.8611 3042.5167 3052.1371 3073.0902 3074.1284 3080.8258 3081.2840 3082.8036 3099.5736 3104.5518 3131.7720
redmass: 1.0171 2.2710 2.8516 3.0302 3.1129 1.6325 1.2666 1.4146 2.3537 2.4048 2.0774 3.6092 2.8015 2.8615 3.6580 3.3341 3.3260 3.3208 4.2955 3.1487 1.1891 1.2242 1.3276 2.8118 1.3919 1.3526 2.3093 1.8776 1.8080 1.5427 1.5190 1.6470 1.9406 1.8781 1.8680 1.4935 1.6331 1.5330 1.3359 2.1408 1.2508 1.5258 1.5271 4.6283 1.2825 1.2103 1.2277 2.8757 1.0672 1.0449 1.0431 1.0544 1.1111 1.0935 1.0866 1.1382 2.3919 6.2881 6.5337 1.0386 1.0350 1.0348 1.0606 1.0615 1.1007 1.0994 1.0949 1.1000 1.0999 1.1010 1.0997 1.1007 1.0908 1.0868 1.0966
irintensity: 0.5126 0.0664 0.1543 0.4668 1.7944 0.2093 0.2683 0.2511 0.7746 0.7791 0.2170 0.1296 1.8823 3.1011 4.0228 5.5504 2.3662 0.1788 0.2491 0.4693 3.3661 5.0401 35.5365 4.8009 4.3104 0.9002 5.5887 2.5386 0.4422 5.8074 12.8342 6.4334 10.3353 11.2003 0.2909 5.4953 0.1512 0.6510 0.7208 0.5488 0.1708 0.7421 1.6805 0.3350 10.0841 10.4186 8.7237 3.7949 2.8244 20.8284 9.4976 12.7555 7.4358 0.2937 17.0988 11.3140 24.8957 1.6072 7.5492 46.2975 39.0243 37.6345 50.0235 16.7610 11.9987 8.0764 25.0860 60.5799 54.4889 25.4929 26.4003 51.7125 31.8997 14.4843 28.3660
temp: 298.150 k
press: 1.00000 atm
elementType: 6 6 6 6 6 6 6 6 6 6 6 1 1 1 1 1 1 1 1 1 1 1 1 1 1 1 1
symmnumber: 1
zpe: 621351.5 jmol-1
zpe.correction: 0.236660 hartree
zpe.thermalcorrener: 0.248849 hartree
zpe.thermalcorrenthalpy: 0.249793 hartree
zpe.thermalcorrgfe: 0.198047 hartree
zpe.sumelectzpe: -427.938685 hartree
zpe.sumelectthermal: -427.926497 hartree
zpe.sumelectthermalent: -427.925552 hartree
zpe.sumelectthermalfe: -427.977299 hartree
dipole: 0.2056 0.2829 0.0250
dipole: 0.3506
quadrupole: -62.5551 -64.5311 -70.9672
quadrupole: -0.2643 -0.3798 2.6040
quadrupole: 3.4627 1.4867 -4.9494 -0.2643 -0.3798 2.6040
hfenergy: -428.1753457 hartree
pointgroup: C01 [X(C11H16)]
dipole: 0.0842293 -0.1089704 -0.0077214 debye
polarizability: 149.2659157|0.3786796|123.5760558|1.0062757|9.5505434|79.0745937 unknown
InChI: InChI=1S/C11H16/c1-4-10-7-6-9(3)8-11(10)5-2/h6-8H,4-5H2,1-3H3
charge 0 multiplicity 1
27 atoms
C  0.305357 -0.637527 -0.214656
C  0.672151 0.657024 0.263601
C  1.342493 -1.720591 -0.495862
C  2.12662 1.087302 0.427888
C  -1.068232 -0.942082 -0.3920
C  -2.09956 -0.013688 -0.108191
C  -0.359155 1.58946 0.542263
C  -1.721195 1.268719 0.361429
C  1.678007 -2.560302 0.767307
C  2.719289 1.685587 -0.877619
C  -3.562234 -0.388483 -0.280134
H  0.959108 -2.399964 -1.28112
H  2.275067 -1.278382 -0.892497
H  2.192783 1.848955 1.228388
H  2.754741 0.237424 0.753246
H  -1.339928 -1.939271 -0.765529
H  -0.084621 2.588325 0.905961
H  -2.49374 2.014739 0.585792
H  2.082619 -1.922235 1.574219
H  2.427011 -3.340697 0.5374
H  0.771433 -3.055693 1.159255
H  2.688655 0.950561 -1.702773
H  3.770837 1.99511 -0.731198
H  2.139896 2.569678 -1.199447
H  -3.70376 -1.099876 -1.113302
H  -3.961197 -0.871059 0.633735
H  -4.186745 0.500166 -0.480258
