program: Gaussian 09
title: 000033044
version: EM64L-G09RevD.01
frameworkgroup: C1[X(C11H16)]
method: RPBEPBE
basis: SDD
operation: Freq
keyword: #p
keyword: freq=noraman
keyword: PBEPBE/SDD
title: #p freq=noraman PBEPBE/SDD
converged: YES YES NO NO
title: Mulliken charges:
elementType: C C C C C C C C C C C H H H H H H H H H H H H H H H H
charge: 0.373754 0.510505 0.300842 -0.546173 -0.597180 -0.538990 -0.427199 -0.410937 -0.834391 -0.683447 -0.674038 0.212887 0.211044 0.235331 0.206547 0.206811 0.229428 0.224470 0.226832 0.230430 0.228037 0.217507 0.216043 0.224629 0.221333 0.213841 0.222086
chargesum: 0.00000
title: Mulliken charges with hydrogens summed into heavy atoms:
elementType: C C C C C C C C C C C
charge: 0.373754 0.510505 0.300842 -0.122242 -0.361849 -0.125632 -0.197771 -0.186467 -0.149092 -0.025269 -0.016778
polarizability: 1.51410035e+02 2.80155693e-01 1.22375877e+02 1.54314488e+00 7.98473496e+00 7.82705817e+01
1716.lowfreq: -9.3367 -5.0328 -0.0009 -0.0007 -0.0004 12.6962 39.4931 69.3234 104.4377
frequency: 38.6906 69.3171 104.4164 121.8810 147.4708 196.4805 209.6998 215.3415 292.0710 309.9026 320.1070 366.1933 432.8211 456.5815 475.3603 555.5462 634.6483 697.6550 727.2000 743.5155 785.1921 798.3142 831.7494 881.3762 907.3304 954.1949 967.1627 977.9851 1002.5345 1037.8222 1042.6411 1061.5734 1064.1530 1074.5351 1134.2365 1167.8648 1213.1008 1243.0657 1250.6608 1252.6423 1292.5778 1310.8155 1319.3244 1376.8884 1383.5631 1388.6360 1398.7551 1414.8192 1468.6015 1469.3609 1472.0557 1473.2276 1473.6214 1482.9171 1489.2818 1493.4576 1500.6302 1584.4568 1622.9592 2970.9519 2976.4847 2977.3091 2982.4365 2987.9941 3033.0886 3036.5073 3046.6344 3073.8858 3074.3007 3078.9599 3081.3829 3081.7727 3097.1948 3107.4027 3132.7740
redmass: 2.3741 2.5298 2.8854 3.1561 1.0728 1.2103 2.1532 1.2216 2.0804 2.1233 2.6513 3.5560 2.6547 3.1502 3.1229 3.6699 3.6640 4.2437 3.1747 2.6662 1.1726 1.2502 1.3480 2.9384 1.4412 1.3453 2.2587 1.6787 2.0364 1.5775 1.4689 1.9569 2.0401 1.4913 1.8799 1.5295 1.7103 1.2992 1.3147 2.6349 1.3069 1.4234 1.6804 4.5420 1.2345 1.2057 1.2487 2.8919 1.0601 1.0739 1.0428 1.0702 1.0584 1.0833 1.0953 1.1031 2.6624 6.3758 6.5466 1.0379 1.0354 1.0349 1.0594 1.0601 1.1017 1.1011 1.0962 1.0999 1.0999 1.0995 1.1010 1.1000 1.0908 1.0867 1.0968
irintensity: 0.0387 0.2731 0.9590 0.8007 0.2710 0.1226 0.1845 0.1549 0.6135 0.2589 0.6881 0.7537 0.0407 6.8317 3.1561 1.5712 4.2760 0.1531 0.4848 3.5268 4.2097 3.0328 29.9205 7.7548 9.8886 0.2992 3.2897 7.7252 1.9349 10.5147 4.3545 12.0214 7.4866 3.3011 2.9967 6.1178 0.0676 0.2083 0.3117 0.7073 0.4258 1.9776 1.0199 0.4491 7.9689 9.8692 10.2223 2.9999 17.0481 8.1302 12.9297 1.8179 11.0878 9.1812 8.5036 12.5082 29.2595 3.6041 4.7897 41.1811 34.3294 50.8429 35.9003 37.1100 9.0705 8.9296 22.7221 73.7842 48.9063 33.7400 42.4047 24.0815 30.1141 15.7026 28.9251
temp: 298.150 k
press: 1.00000 atm
elementType: 6 6 6 6 6 6 6 6 6 6 6 1 1 1 1 1 1 1 1 1 1 1 1 1 1 1 1
symmnumber: 1
zpe: 621568.1 jmol-1
zpe.correction: 0.236743 hartree
zpe.thermalcorrener: 0.248819 hartree
zpe.thermalcorrenthalpy: 0.249764 hartree
zpe.thermalcorrgfe: 0.198500 hartree
zpe.sumelectzpe: -427.939355 hartree
zpe.sumelectthermal: -427.927278 hartree
zpe.sumelectthermalent: -427.926334 hartree
zpe.sumelectthermalfe: -427.977597 hartree
dipole: 0.3047 -0.3036 0.0571
dipole: 0.4339
quadrupole: -62.2442 -64.4768 -71.3335
quadrupole: 0.1565 0.2296 2.2645
quadrupole: 3.7739 1.5413 -5.3153 0.1565 0.2296 2.2645
hfenergy: -428.1760974 hartree
pointgroup: C01 [X(C11H16)]
dipole: 0.1217093 -0.117408 0.0232913 debye
polarizability: 151.3953225|0.7403671|122.5050289|1.3926479|7.687193|78.156142 unknown
InChI: InChI=1S/C11H16/c1-4-10-7-6-9(3)11(5-2)8-10/h6-8H,4-5H2,1-3H3
charge 0 multiplicity 1
27 atoms
C  0.957897 -0.337567 -0.354405
C  -1.486905 0.105708 -0.323706
C  1.216584 1.011289 0.038266
C  2.086832 -1.341574 -0.557217
C  -0.383742 -0.75866 -0.529572
C  -2.916833 -0.394593 -0.478982
C  -1.21619 1.440445 0.065378
C  0.114333 1.879052 0.240707
C  2.634262 1.533333 0.217198
C  2.463697 -2.084805 0.753909
C  -3.488649 -0.975569 0.842221
H  1.782853 -2.089905 -1.313974
H  2.987634 -0.837452 -0.955441
H  -0.572864 -1.795325 -0.842216
H  -3.569091 0.432812 -0.819285
H  -2.958578 -1.176708 -1.261753
H  -2.047056 2.139601 0.223897
H  0.304968 2.919077 0.534166
H  3.213412 0.923807 0.93568
H  3.195692 1.524544 -0.737343
H  2.625748 2.572665 0.588398
H  2.784196 -1.375215 1.538442
H  3.288939 -2.800376 0.581085
H  1.596854 -2.645876 1.147653
H  -2.877243 -1.8263 1.194434
H  -4.526825 -1.330453 0.703006
H  -3.489223 -0.211254 1.640554
