program: Gaussian 09
title: 000033050
version: EM64L-G09RevD.01
frameworkgroup: C1[X(C7H3Cl2NO)]
method: RPBEPBE
basis: SDD
operation: Freq
keyword: #p
keyword: freq=noraman
keyword: PBEPBE/SDD
title: #p freq=noraman PBEPBE/SDD
converged: NO NO NO NO
title: Mulliken charges:
elementType: Cl Cl O N C C C C C C C H H H
charge: 0.030452 -0.001980 -0.160070 0.081584 0.494151 -0.288044 -0.366518 -0.044364 -0.177620 -0.244114 -0.095239 0.260547 0.265425 0.245789
chargesum: 0.00000
title: Mulliken charges with hydrogens summed into heavy atoms:
elementType: Cl Cl O N C C C C C C C
charge: 0.030452 -0.001980 -0.160070 0.081584 0.494151 -0.288044 -0.105970 -0.044364 0.068170 0.021311 -0.095239
polarizability: 1.63436673e+02 -1.05311649e+01 1.17079971e+02 3.72286833e-01 -1.48664469e-01 3.69553129e+01
1716.lowfreq: -41.1600 -6.4530 0.0011 0.0019 0.0024 3.3199 5.2717 53.1571 116.3768
frequency: -41.1222 53.1253 116.3630 192.3057 209.2940 252.3158 275.6299 333.9638 405.3383 476.7859 481.8643 487.5723 502.9525 510.4445 552.6726 709.6293 712.0577 785.8828 791.5198 894.9544 971.3997 1016.5641 1075.9006 1143.8689 1156.8551 1201.3478 1347.4030 1398.8169 1415.3874 1537.2571 1556.3651 1600.4348 2399.4975 3154.5691 3172.8906 3185.1165
redmass: 13.7968 17.6806 9.5854 30.1461 5.1631 14.6169 6.7020 19.7113 7.9502 11.8717 9.1717 12.3729 4.1586 7.7804 5.0616 2.8219 7.2651 1.5752 8.7550 1.3875 1.3370 7.5971 2.5428 2.6193 1.4946 1.4654 8.2718 2.6244 2.6371 9.5122 6.5347 8.0061 12.7467 1.0873 1.0931 1.0997
irintensity: 0.0640 0.1389 0.1897 0.0103 1.1030 0.5529 1.7426 0.3653 2.4393 14.2832 3.1978 26.8209 0.2041 4.4623 0.3217 14.1427 7.7749 71.1908 93.4136 1.2545 1.5002 16.3399 6.3115 26.5664 15.6759 21.0026 8.3255 50.5688 52.1995 2.0365 24.6333 63.1444 1579.0526 4.5520 2.2253 4.2674
temp: 298.150 k
press: 1.00000 atm
elementType: 17 17 8 7 6 6 6 6 6 6 6 1 1 1
symmnumber: 1
zpe: 215796.4 jmol-1
zpe.correction: 0.082193 hartree
zpe.thermalcorrener: 0.091265 hartree
zpe.thermalcorrenthalpy: 0.092209 hartree
zpe.thermalcorrgfe: 0.046553 hartree
zpe.sumelectzpe: -1317.869324 hartree
zpe.sumelectthermal: -1317.860251 hartree
zpe.sumelectthermalent: -1317.859307 hartree
zpe.sumelectthermalfe: -1317.904964 hartree
dipole: -1.8571 3.5221 -0.0017
dipole: 3.9817
quadrupole: -87.0367 -67.6787 -77.2467
quadrupole: 0.1703 -0.2070 0.0604
quadrupole: -9.7160 9.6420 0.0740 0.1703 -0.2070 0.0604
hfenergy: -1317.9515161 hartree
pointgroup: C01 [X(C7H3Cl2N1O1)]
dipole: -0.8158653 1.3372508 -0.0116303 debye
dipolederiv: -0.0623511 0.1801869 -0.001153 0.1258154 -0.5776266 0.0058383 -0.000083 0.0062531 -0.0009447 -0.4750553 -0.2971309 0.0182373 -0.3681559 -0.3334876 0.0161531 0.0210212 0.0153076 -0.030594 -1.8904428 0.2976294 -0.0093747 0.4284618 -0.332799 0.0022184 -0.0021309 0.0003816 -0.2639546 -2.3529557 0.3843655 0.0117608 0.5355634 -0.3895902 0.0019076 -0.0155523 0.0096265 -0.1973917 1.4876666 -0.1246137 -0.0347173 -0.2101609 0.1007869 0.0062653 -0.0237895 0.0027447 0.1656415 -0.3265581 -0.2707577 0.009538 -0.4157494 0.7678168 -0.0005233 0.0161414 -0.0102802 -0.0895431 -0.2007808 0.0049608 -0.0030777 0.2166125 -0.0522196 -0.0087287 -0.0039616 -0.0025971 -0.1756608 0.7170111 0.4355916 -0.030269 0.6841172 0.3758193 -0.0271652 -0.0381451 -0.0207885 -0.0147088 0.1046702 0.0234474 -0.0082551 -0.0697309 0.1092459 -0.0029196 -0.0073124 -0.0047233 -0.1310844 -0.2101209 -0.0638106 0.0024462 -0.1530965 -0.1969519 0.006509 0.0063016 0.0034815 -0.1192287 3.155082 -0.5610962 0.030246 -0.768701 0.4967112 -0.0086156 0.0323473 -0.0087441 0.3445103 0.0106121 -0.072335 0.0069859 -0.0693587 0.0231944 0.0044855 0.0076184 0.0050857 0.1764133 -0.0176519 0.0278375 0.0053024 0.0197379 0.0824589 0.0010387 0.0054437 0.0006766 0.1708668 0.0608747 0.035725 0.0023302 0.0446451 -0.0733586 0.0035366 0.0021011 0.0035759 0.165679 unknown
polarizability: 164.5314671|-7.5970574|115.9112707|-2.1428147|-1.6263345|37.0292196 unknown
InChI: InChI=1S/C7H3Cl2NO/c8-5-2-1-3-6(7(5)9)10-4-11/h1-3H
charge 0 multiplicity 1
14 atoms
Cl -0.006398 -2.346081 0.061079
Cl -3.167969 -1.513469 0.143664
O  4.160519 -0.589007 -0.001665
N  1.822725 0.058373 -0.048658
C  0.491844 0.396576 -0.008527
C  -0.51375 -0.617107 0.042122
C  0.097693 1.761487 -0.022768
C  -1.875184 -0.2503 0.078242
C  -1.26681 2.106209 0.013853
C  -2.261877 1.105869 0.064533
C  2.983856 -0.271862 -0.015086
H  0.874878 2.529768 -0.062879
H  -3.323586 1.364844 0.093333
H  -1.56174 3.1597 0.002855
