program: Gaussian 09
title: 000033064
version: EM64L-G09RevD.01
frameworkgroup: C1[X(C13H16N2O)]
method: RPBEPBE
basis: SDD
operation: Freq
keyword: #p
keyword: freq=noraman
keyword: PBEPBE/SDD
title: #p freq=noraman PBEPBE/SDD
converged: YES YES NO NO
title: Mulliken charges:
elementType: O N N C C C C C C C C C C C C C H H H H H H H H H H H H H H H H
charge: -0.256789 -0.088742 0.014515 -0.403073 -0.387448 -0.379783 -0.375464 -0.361778 -0.365939 0.083460 0.268151 -0.324788 -0.345127 -0.242959 -0.235533 -0.230536 0.199040 0.226238 0.212999 0.209452 0.207018 0.210867 0.229655 0.226793 0.210728 0.242755 0.222813 0.280331 0.277242 0.222162 0.227011 0.226730
chargesum: 0.00000
title: Mulliken charges with hydrogens summed into heavy atoms:
elementType: O N N C C C C C C C C C C C C C
charge: -0.256789 -0.088742 0.014515 0.022205 0.035002 0.038102 0.080985 0.091705 -0.143126 0.083460 0.268151 -0.044457 -0.067885 -0.020797 -0.008522 -0.003807
polarizability: 2.60685429e+02 6.40770730e+00 1.68319196e+02 -7.36006183e-02 2.00981358e+00 8.51559443e+01
1716.lowfreq: -20.3719 -15.2380 -5.4818 0.0002 0.0007 0.0009 6.5278 28.6753 43.3184
frequency: -18.0695 27.6076 43.3055 72.7497 138.3872 156.5935 187.6814 205.2454 223.5703 247.1545 317.8270 349.9725 360.7346 402.1217 407.6262 440.3319 443.9848 455.5980 530.0025 593.1408 615.8891 643.1870 679.4267 701.5622 740.9261 769.3751 796.1709 801.4572 849.1874 851.5103 864.3297 894.0945 918.6847 948.9048 954.9820 989.8674 991.8791 996.5258 1007.3916 1023.6327 1045.2334 1075.2921 1083.7033 1090.4729 1106.4449 1122.9338 1152.0149 1170.3279 1172.4177 1187.6196 1242.9175 1258.3088 1268.1223 1295.3841 1304.7128 1313.6949 1331.8890 1340.9313 1347.8004 1351.5606 1364.7892 1378.5809 1383.0535 1431.6874 1457.1269 1462.8357 1466.4542 1467.7509 1475.7417 1477.4691 1507.5395 1536.0415 1587.6099 1608.2329 2926.8178 2932.1740 2974.6868 2991.7490 2992.7192 3045.2489 3050.8037 3055.3964 3060.7433 3065.6564 3083.5143 3121.3127 3134.4608 3150.0284 3162.9734 3182.7014
redmass: 3.6027 3.5802 3.8175 4.7430 4.7837 4.1653 2.9656 2.5196 4.3641 2.8665 3.6608 1.7714 4.8191 2.8693 5.3747 3.0245 4.0244 3.0823 2.9374 3.6938 6.3903 4.5566 4.3460 1.5450 4.6883 3.5928 1.8824 1.7701 1.8302 1.8559 1.2469 1.6057 2.3552 1.3139 1.4412 4.9925 2.7262 1.4520 1.3330 2.5817 1.9661 1.9380 2.0622 1.4053 2.2328 2.3745 1.3291 1.0835 1.9863 1.1840 2.0691 1.3006 1.2701 1.7628 1.8903 1.3459 1.2831 1.4044 1.4342 1.5572 1.5677 1.9594 8.1877 2.3483 1.0897 1.0960 1.0861 1.0879 2.0231 1.1651 7.7225 4.9599 6.3213 6.0665 1.0703 1.0694 1.0645 1.0616 1.0609 1.0962 1.0958 1.0966 1.0984 1.0918 1.0920 1.0851 1.0896 1.0944 1.0983 1.0949
irintensity: 0.0152 1.0670 2.4264 0.7064 0.8055 0.7643 1.3837 1.3231 4.6970 9.1580 5.0860 4.7441 17.3670 0.0818 4.5508 0.5003 3.5535 2.7643 3.4201 2.2097 1.1442 40.8110 6.1579 76.4430 2.1832 25.4631 27.6513 15.7114 34.5376 8.6019 1.5644 32.9887 8.3942 4.7356 3.7373 4.1114 60.5442 3.8642 1.0137 15.5547 3.1950 60.8673 27.3790 21.0517 57.5556 7.7450 12.3933 7.4692 88.8013 9.0446 1.1780 19.4150 14.7313 31.1520 333.9809 10.8331 16.0353 0.9467 0.8343 23.4234 6.2591 31.3349 2.5704 10.1285 7.6304 45.5397 15.8692 23.8438 0.8085 5.6740 106.1655 319.0584 19.3975 7.8904 36.2765 69.0933 39.1732 28.5141 31.3051 68.5618 19.1436 21.4545 65.6490 43.2756 18.0374 0.3085 20.2366 18.5750 28.1966 15.5473
temp: 298.150 k
press: 1.00000 atm
elementType: 8 7 7 6 6 6 6 6 6 6 6 6 6 6 6 6 1 1 1 1 1 1 1 1 1 1 1 1 1 1 1 1
symmnumber: 1
zpe: 696467.7 jmol-1
zpe.correction: 0.265271 hartree
zpe.thermalcorrener: 0.278810 hartree
zpe.thermalcorrenthalpy: 0.279755 hartree
zpe.thermalcorrgfe: 0.223931 hartree
zpe.sumelectzpe: -688.491311 hartree
zpe.sumelectthermal: -688.477771 hartree
zpe.sumelectthermalent: -688.476827 hartree
zpe.sumelectthermalfe: -688.532651 hartree
dipole: -5.4797 -3.2138 0.2906
dipole: 6.3592
quadrupole: -75.6707 -98.2133 -97.5646
quadrupole: -8.4654 -0.1752 0.4453
quadrupole: 14.8122 -7.7305 -7.0817 -8.4654 -0.1752 0.4453
hfenergy: -688.7565815 hartree
pointgroup: C01 [X(C13H16N2O1)]
dipole: -2.199594 -0.4441483 -1.1063865 debye
polarizability: 260.1175543|13.1915803|87.3169569|0.1676222|9.9730416|166.7260575 unknown
InChI: InChI=1S/C13H16N2O/c16-13(12-7-3-1-4-8-12)11-14-15-9-5-2-6-10-15/h1,3-4,7-8,11H,2,5-6,9-10H2
charge 0 multiplicity 1
32 atoms
O  1.83751 0.311744 2.694154
N  -2.120185 -0.440475 0.282781
N  -0.764742 -0.345384 0.323724
C  -5.00412 -0.666772 -0.104834
C  -4.418258 0.148765 1.068612
C  -4.039864 -0.611716 -1.311215
C  -3.00794 -0.341541 1.468817
C  -2.647337 -1.137232 -0.913452
C  -0.110011 -0.032994 1.438391
C  1.35938 0.109643 1.521083
C  2.299806 0.027146 0.344088
C  1.891407 -0.014419 -1.017472
C  3.6915 0.018884 0.643508
C  2.856365 -0.061516 -2.047892
C  4.651127 -0.034319 -0.385822
C  4.236186 -0.07376 -1.739065
H  -5.150715 -1.721612 0.206728
H  -5.998405 -0.272183 -0.383953
H  -4.355488 1.214787 0.776424
H  -5.074179 0.089329 1.957413
H  -4.423725 -1.220626 -2.150928
H  -3.952251 0.432285 -1.669507
H  -2.566255 0.371046 2.186314
H  -3.067987 -1.331932 1.97373
H  -2.711987 -2.228935 -0.703836
H  -1.906624 -0.99448 -1.716474
H  -0.590469 0.116011 2.418991
H  0.825456 -0.013954 -1.253194
H  3.987169 0.061078 1.697114
H  2.531274 -0.088361 -3.094425
H  5.718688 -0.04307 -0.138656
H  4.980671 -0.110936 -2.542845
