program: Gaussian 09
title: 000033073
version: EM64L-G09RevD.01
frameworkgroup: C1[X(C13H16N2O2)]
method: RPBEPBE
basis: SDD
operation: Freq
keyword: #p
keyword: freq=noraman
keyword: PBEPBE/SDD
title: #p freq=noraman PBEPBE/SDD
converged: YES YES NO NO
title: Mulliken charges:
elementType: O O N N C C C C C C C C C C C C C H H H H H H H H H H H H H H H H
charge: -0.245458 -0.254177 -0.114044 0.019118 -0.336357 -0.343949 -0.300085 -0.310604 -0.365700 0.271320 0.077131 0.448428 -0.314693 -0.350138 -0.428117 -0.367303 -0.807730 0.237710 0.229882 0.241990 0.227521 0.226207 0.202177 0.200649 0.229369 0.223097 0.281460 0.276141 0.226357 0.229742 0.224582 0.235223 0.230250
chargesum: 0.00000
title: Mulliken charges with hydrogens summed into heavy atoms:
elementType: O O N N C C C C C C C C C C C C C
charge: -0.245458 -0.254177 -0.114044 0.019118 0.131235 0.125562 0.128298 0.119414 -0.142603 0.271320 0.077131 0.448428 -0.033233 -0.073998 -0.201760 -0.137561 -0.117675
polarizability: 2.71598106e+02 2.50454558e+00 1.79766528e+02 9.41512586e-01 4.45426256e-01 8.71938619e+01
1716.lowfreq: -7.5095 -3.5308 -0.0003 0.0000 0.0004 9.7373 17.8614 23.3824 29.8940
frequency: 17.6022 22.8944 29.6760 47.9006 67.6454 103.7023 147.1216 175.7520 201.7971 209.3670 250.6519 271.2870 314.2070 347.3880 354.5054 374.5697 392.9890 405.9008 459.4340 461.6697 480.0626 546.4285 582.1041 626.1166 640.3471 678.9169 710.4756 744.6296 769.3213 806.5561 809.5734 832.5959 848.9832 864.7178 898.6414 917.2920 985.2629 990.3870 993.2665 1002.5931 1011.4338 1014.8614 1046.7234 1051.6091 1076.6654 1081.8146 1098.2798 1120.4760 1147.3843 1177.5776 1191.9181 1193.7057 1222.7593 1257.7816 1276.3701 1292.1084 1303.4555 1307.0786 1331.7714 1341.7646 1357.6676 1363.7002 1368.8534 1377.5028 1396.0222 1411.0884 1447.9986 1449.8222 1453.7071 1458.9194 1467.9264 1472.4231 1500.1352 1505.5808 1537.3856 1578.1518 1620.0240 2950.2437 2953.8086 2960.0678 2965.4544 2975.6745 3051.1333 3054.3742 3060.6844 3082.5271 3086.1802 3089.3191 3095.0533 3119.6818 3122.9533 3157.4574 3180.2558
redmass: 2.6049 1.1454 3.8248 4.5363 5.1742 4.5012 4.5174 4.3127 5.1149 2.0330 3.0017 3.5157 5.1102 3.4232 4.3040 2.1626 4.1603 2.8992 4.5079 3.4661 2.9429 4.7073 3.6226 3.4121 4.9929 3.9742 3.9981 2.8626 4.6210 4.3734 4.0849 1.6392 1.4893 1.2574 1.6504 2.2983 1.4168 1.4685 2.2982 1.3623 2.4937 2.8911 1.5823 1.8894 3.7396 3.8988 2.2961 1.3038 2.2895 2.6965 1.0713 1.1472 2.8947 1.5096 1.3103 1.7453 1.7976 1.2919 1.2760 1.2918 1.3576 2.2449 3.5331 1.5348 1.2422 3.7717 1.0800 1.0831 1.1001 1.0982 1.0927 1.1076 2.8917 5.1966 5.3007 6.2977 6.3092 1.0690 1.0699 1.0647 1.0656 1.0378 1.0919 1.0964 1.0895 1.0937 1.0990 1.0965 1.0977 1.0894 1.0902 1.0945 1.0938
irintensity: 0.0737 0.7814 0.1472 2.9880 2.0235 0.0557 1.6987 4.0067 3.5223 3.7802 30.6281 0.0844 0.4669 5.2556 6.7438 5.8076 14.2660 0.0956 2.6410 3.6807 12.9222 13.7010 6.0314 33.5997 4.0463 7.3240 31.6660 10.4092 16.1203 21.9264 6.8148 7.4995 51.4591 3.1296 24.9902 5.0764 3.9661 19.4287 94.9968 1.4902 21.2688 2.2663 16.4702 19.0868 25.5380 94.6803 28.4301 12.2701 166.5683 16.5080 1.1855 28.8382 0.0815 8.2871 5.4885 56.8609 329.1145 3.0042 27.2892 9.1163 10.0197 18.2665 9.1943 15.9753 13.7918 13.3866 10.5949 1.0723 60.9954 4.7923 11.3737 12.0038 9.0111 131.7835 293.2089 35.4233 54.5911 45.5308 37.2961 22.9268 110.2548 33.6167 20.1557 20.6112 40.7846 16.5446 17.7319 28.2902 34.2375 23.4948 16.7698 9.3201 11.1096
temp: 298.150 k
press: 1.00000 atm
elementType: 8 8 7 7 6 6 6 6 6 6 6 6 6 6 6 6 6 1 1 1 1 1 1 1 1 1 1 1 1 1 1 1 1
symmnumber: 1
zpe: 703414.1 jmol-1
zpe.correction: 0.267916 hartree
zpe.thermalcorrener: 0.284083 hartree
zpe.thermalcorrenthalpy: 0.285027 hartree
zpe.thermalcorrgfe: 0.221045 hartree
zpe.sumelectzpe: -763.617568 hartree
zpe.sumelectthermal: -763.601401 hartree
zpe.sumelectthermalent: -763.600457 hartree
zpe.sumelectthermalfe: -763.664439 hartree
dipole: -2.0190 -3.4855 0.3754
dipole: 4.0455
quadrupole: -89.4925 -102.6509 -102.3683
quadrupole: -10.9511 -2.8772 0.1991
quadrupole: 8.6781 -4.4804 -4.1977 -10.9511 -2.8772 0.1991
hfenergy: -763.8854839 hartree
pointgroup: C01 [X(C13H16N2O2)]
dipole: 0.8617379 0.5855587 1.2032225 debye
polarizability: 271.1425257|7.3884287|111.7606096|-6.3212939|40.4513967|155.6553615 unknown
InChI: InChI=1S/C13H16N2O2/c1-11-2-4-12(5-3-11)13(16)10-14-15-6-8-17-9-7-15/h2-5,10H,6-9H2,1H3
charge 0 multiplicity 1
33 atoms
O  5.268813 0.811536 0.155549
O  -1.19075 -1.311245 -2.725339
N  2.478765 0.351002 -0.330329
N  1.128302 0.234453 -0.475805
C  2.912792 1.442764 0.568165
C  3.480855 -0.118812 -1.319749
C  4.27229 1.103965 1.200465
C  4.834001 -0.358145 -0.616978
C  0.593871 -0.462844 -1.471547
C  -1.930667 -0.195601 -0.719673
C  -0.860941 -0.671615 -1.663385
C  -4.116137 0.608553 0.957122
C  -1.691533 0.455086 0.520886
C  -3.279765 -0.438321 -1.10627
C  -2.772008 0.845968 1.340861
C  -4.34917 -0.043946 -0.284787
C  -5.27578 1.044023 1.834188
H  2.133646 1.571982 1.337516
H  3.000572 2.390145 -0.00533
H  3.590537 0.62779 -2.135436
H  3.144387 -1.071644 -1.765426
H  4.668812 1.965621 1.760584
H  4.173452 0.23022 1.879949
H  4.751727 -1.241361 0.052686
H  5.624937 -0.536116 -1.363291
H  1.180093 -0.943122 -2.272389
H  -0.662717 0.648053 0.83104
H  -3.452764 -0.945829 -2.061176
H  -2.56929 1.343486 2.297411
H  -5.380322 -0.242542 -0.602757
H  -4.931292 1.373826 2.829261
H  -5.827254 1.886488 1.373851
H  -6.002361 0.223181 1.978331
