program: Gaussian 09
title: 000033046
version: EM64L-G09RevD.01
frameworkgroup: C1[X(C11H16)]
method: RPBEPBE
basis: SDD
operation: Freq
keyword: #p
keyword: freq=noraman
keyword: PBEPBE/SDD
title: #p freq=noraman PBEPBE/SDD
converged: YES YES NO NO
title: Mulliken charges:
elementType: C C C C C C C C C C C H H H H H H H H H H H H H H H H
charge: 0.186873 0.378653 -0.566055 0.334727 -0.564291 -0.426478 -0.440173 -0.243744 -0.690489 -0.840869 -0.680344 0.219964 0.219952 0.213494 0.214085 0.230347 0.227621 0.222065 0.219812 0.217244 0.221287 0.228064 0.230792 0.229331 0.225454 0.215361 0.217317
chargesum: 0.00000
title: Mulliken charges with hydrogens summed into heavy atoms:
elementType: C C C C C C C C C C C
charge: 0.186873 0.378653 -0.126140 0.334727 -0.136712 -0.196131 -0.212552 -0.021679 -0.032147 -0.152682 -0.022212
polarizability: 1.36954057e+02 -1.57164162e+00 1.32643667e+02 6.08915506e+00 6.69246267e+00 7.78698573e+01
1716.lowfreq: -16.9914 -0.0006 0.0007 0.0009 2.3466 10.9871 75.1720 92.5629 94.5106
frequency: 75.1608 92.5309 94.4604 142.4775 160.0613 204.8918 208.5198 213.4697 275.6051 322.2044 365.1620 367.3150 451.8143 480.4990 525.8930 553.8042 585.3700 636.6931 761.1408 773.5163 780.0242 792.8683 799.3492 879.4035 905.3478 964.5742 973.3509 976.6711 999.2992 1036.4746 1042.2340 1056.3907 1063.4210 1100.8497 1106.0562 1175.4001 1191.3621 1235.7022 1246.7934 1258.7733 1276.2897 1310.6387 1313.4222 1373.4690 1382.7636 1388.0651 1400.1750 1443.5856 1455.6525 1469.2892 1469.4283 1471.0526 1476.0912 1478.6402 1486.8925 1491.1567 1509.8780 1595.2088 1604.4018 2971.0248 2976.8262 2977.6752 2993.1931 3005.1485 3040.2875 3046.4282 3049.0937 3073.3781 3074.6384 3079.1707 3081.5158 3083.1203 3110.4539 3120.2190 3150.0282
redmass: 2.6490 2.6161 2.7913 3.0401 1.0966 1.7401 1.0397 1.3801 2.8005 2.4399 3.3724 2.2051 2.3408 3.8911 4.5556 3.4368 3.5107 3.3733 1.8734 1.3522 1.5319 2.0035 1.7702 2.3502 1.3481 2.2618 1.3524 2.0702 1.5879 1.5933 1.4857 1.9885 2.0965 1.6895 1.6951 1.1778 2.7730 1.4685 1.3310 2.3171 1.2876 1.5245 1.5020 5.0075 1.2114 1.2076 1.2429 2.0393 2.5303 1.0591 1.1103 1.0466 1.0789 1.0818 1.1405 1.1019 1.0858 7.0890 6.0159 1.0381 1.0349 1.0349 1.0609 1.0607 1.1004 1.0964 1.0994 1.1000 1.0999 1.1000 1.1001 1.1002 1.0860 1.0910 1.0992
irintensity: 0.0593 0.0174 0.0361 1.2816 1.0260 0.5225 0.0498 0.3799 0.2078 0.7222 7.6709 0.2333 0.7221 0.3519 1.8432 0.9284 0.9684 0.2500 30.3056 2.8294 0.9324 19.6155 12.8650 9.1630 0.4286 6.3297 0.3216 1.3917 1.0587 9.0651 2.5226 8.1854 17.0816 3.1923 1.9928 1.8845 0.6581 0.6239 0.8581 0.4714 0.6985 0.7212 0.8508 0.5801 8.3490 14.9090 11.6788 0.9098 11.7742 10.5506 7.0147 11.7691 8.5366 3.6810 22.8407 22.9769 1.3738 7.0886 1.1553 34.7701 38.9139 39.2039 35.7145 26.8246 9.7426 20.2577 7.2000 61.7551 50.6388 43.2147 55.6542 18.7900 3.0868 31.1999 36.1593
temp: 298.150 k
press: 1.00000 atm
elementType: 6 6 6 6 6 6 6 6 6 6 6 1 1 1 1 1 1 1 1 1 1 1 1 1 1 1 1
symmnumber: 1
zpe: 622675.6 jmol-1
zpe.correction: 0.237165 hartree
zpe.thermalcorrener: 0.248999 hartree
zpe.thermalcorrenthalpy: 0.249944 hartree
zpe.thermalcorrgfe: 0.199973 hartree
zpe.sumelectzpe: -427.936081 hartree
zpe.sumelectthermal: -427.924247 hartree
zpe.sumelectthermalent: -427.923302 hartree
zpe.sumelectthermalfe: -427.973274 hartree
dipole: -0.1387 0.7356 0.1595
dipole: 0.7654
quadrupole: -63.1934 -64.6998 -71.3609
quadrupole: 0.3462 1.6594 1.4749
quadrupole: 3.2246 1.7183 -4.9429 0.3462 1.6594 1.4749
hfenergy: -428.1732461 hartree
pointgroup: C01 [X(C11H16)]
dipole: 0.0953647 0.2794658 -0.0589807 debye
polarizability: 137.3279428|0.8133615|132.4863732|4.9808374|-6.7294683|77.6532653 unknown
InChI: InChI=1S/C11H16/c1-4-10-8-6-7-9(3)11(10)5-2/h6-8H,4-5H2,1-3H3
charge 0 multiplicity 1
27 atoms
C  -0.133877 0.475058 -0.115363
C  0.821137 -0.526578 0.240338
C  0.296851 1.927631 -0.307521
C  -1.513279 0.118388 -0.246165
C  2.314336 -0.226418 0.350032
C  0.387699 -1.859491 0.456957
C  -1.912865 -1.222762 -0.024617
C  -0.970282 -2.212816 0.326118
C  0.252164 2.74072 1.016582
C  -2.567097 1.146195 -0.634631
C  3.04927 -0.37311 -1.010676
H  1.320408 1.975195 -0.720633
H  -0.356837 2.421941 -1.049348
H  2.488975 0.789979 0.74816
H  2.770954 -0.927053 1.074877
H  1.127431 -2.621569 0.733445
H  -2.97203 -1.48891 -0.127171
H  -1.293357 -3.245635 0.499077
H  -0.76579 2.745148 1.44647
H  0.559113 3.789706 0.848631
H  0.926967 2.301261 1.77353
H  -2.568131 2.020825 0.042004
H  -2.402882 1.532822 -1.659356
H  -3.575712 0.699612 -0.606907
H  2.935899 -1.39843 -1.406602
H  4.129271 -0.16094 -0.903323
H  2.635664 0.321031 -1.76511
