program: Gaussian 09
title: 000033059
version: EM64L-G09RevD.01
frameworkgroup: C1[X(C13H16N2O)]
method: RPBEPBE
basis: SDD
operation: Freq
keyword: #p
keyword: freq=noraman
keyword: PBEPBE/SDD
title: #p freq=noraman PBEPBE/SDD
converged: YES YES NO NO
title: Mulliken charges:
elementType: O N N C C C C C C C C C C C C C H H H H H H H H H H H H H H H H
charge: -0.261774 -0.128252 0.021636 -0.443559 -0.458250 -0.341152 -0.363658 -0.373118 0.077796 0.267056 0.447643 -0.320617 -0.349665 -0.407859 -0.392391 -0.808959 0.233085 0.232334 0.232374 0.235687 0.248758 0.228091 0.246261 0.242112 0.233067 0.287464 0.275957 0.224703 0.228551 0.224348 0.226140 0.236189
chargesum: 0.00000
title: Mulliken charges with hydrogens summed into heavy atoms:
elementType: O N N C C C C C C C C C C C C C
charge: -0.261774 -0.128252 0.021636 0.021861 0.009811 0.135697 0.124715 -0.140050 0.077796 0.267056 0.447643 -0.033153 -0.073708 -0.183156 -0.163840 -0.122282
polarizability: 2.67993227e+02 6.81893056e+00 1.74317117e+02 2.52324069e+00 1.96083548e+00 8.43077657e+01
1716.lowfreq: -10.2397 -0.9099 -0.0006 -0.0005 -0.0004 7.7133 19.3624 26.0664 35.5295
frequency: 19.2888 25.8670 35.3686 63.1220 70.7027 103.2377 155.7373 166.6109 198.8669 211.3432 236.6656 278.4927 345.6182 350.2142 359.7041 392.4525 406.4295 478.9541 531.9333 569.9169 577.9997 634.7720 663.6644 680.1699 717.5289 745.7008 793.1681 808.4816 848.5093 853.4341 855.3005 864.7281 895.0390 907.6560 926.5946 982.2023 986.0577 992.8484 1002.3639 1013.2427 1046.5294 1058.5896 1082.3010 1103.4219 1119.2452 1150.8061 1159.3134 1172.8367 1189.9755 1209.2643 1222.7428 1234.7882 1248.6554 1298.6847 1303.4471 1305.8549 1311.8202 1334.3286 1336.1883 1368.6569 1384.0142 1394.7434 1409.9851 1468.0376 1469.8036 1472.3354 1472.7858 1483.0719 1492.0666 1498.7601 1504.8380 1528.8032 1578.7423 1619.5622 2958.2055 2970.2506 2973.4912 3007.6196 3016.0686 3022.1091 3054.7661 3058.3888 3068.2876 3082.9687 3084.8441 3097.1262 3117.8783 3120.9430 3156.3770 3176.9892
redmass: 3.0185 1.0666 3.1174 4.0816 4.1404 4.6272 2.5889 4.5072 2.9620 4.5659 2.2263 3.6406 3.3515 5.5027 3.4028 5.3263 2.9020 2.9141 6.5519 1.9167 5.7134 6.8479 5.0675 3.9321 3.8395 2.8272 2.7090 3.8138 1.5802 1.9111 1.8390 1.2540 1.5660 2.5718 1.3762 1.7044 1.4208 1.3470 1.3643 3.1974 1.5851 1.9750 3.5802 1.5172 1.2971 1.3769 1.6512 2.8015 1.1677 1.3998 2.8779 2.0100 1.5821 1.7385 1.4668 1.2860 1.2541 1.4477 1.5385 4.5642 4.0997 1.2259 3.7615 1.1396 1.0884 1.1014 1.0578 1.0911 1.1324 3.1995 4.3407 4.7294 6.3813 6.3362 1.0600 1.0676 1.0388 1.0868 1.0631 1.0785 1.0944 1.0866 1.0961 1.1012 1.0998 1.1054 1.0899 1.0895 1.0944 1.0940
irintensity: 0.0620 0.5869 1.9145 0.9199 1.0520 0.0238 2.5010 1.3182 5.1758 3.2930 3.2272 0.1781 3.6679 3.2403 3.9452 15.6023 0.0428 14.2513 0.5259 2.6033 15.4020 2.3136 0.4336 6.4611 31.6374 11.1341 1.2093 11.3274 58.9828 17.7755 3.0424 1.5534 27.3164 5.7451 2.7245 6.5716 1.6038 4.2565 0.8484 10.7606 24.0216 11.9350 31.6020 6.0153 17.0720 17.9276 2.8704 2.2710 97.7774 33.0260 0.1804 76.3198 32.6538 251.2972 124.4466 0.9728 11.2546 20.9130 13.0911 2.7401 67.2447 11.2220 10.6996 7.1111 9.9473 48.8635 12.8540 9.0765 28.2556 21.4011 83.7222 338.3417 33.4982 47.5134 34.4838 47.2406 36.5044 10.4476 28.3332 49.4048 24.6532 38.5925 21.4446 30.8585 17.2492 52.3294 24.6147 17.7426 9.8959 12.7530
temp: 298.150 k
press: 1.00000 atm
elementType: 8 7 7 6 6 6 6 6 6 6 6 6 6 6 6 6 1 1 1 1 1 1 1 1 1 1 1 1 1 1 1 1
symmnumber: 1
zpe: 692346.5 jmol-1
zpe.correction: 0.263701 hartree
zpe.thermalcorrener: 0.279078 hartree
zpe.thermalcorrenthalpy: 0.280022 hartree
zpe.thermalcorrgfe: 0.218098 hartree
zpe.sumelectzpe: -688.497923 hartree
zpe.sumelectthermal: -688.482546 hartree
zpe.sumelectthermalent: -688.481602 hartree
zpe.sumelectthermalfe: -688.543526 hartree
dipole: -4.7223 -4.3700 -0.0083
dipole: 6.4340
quadrupole: -62.5579 -100.7710 -97.2721
quadrupole: -2.9994 0.6184 -0.0425
quadrupole: 24.3091 -13.9040 -10.4051 -2.9994 0.6184 -0.0425
hfenergy: -688.7616241 hartree
pointgroup: C01 [X(C13H16N2O1)]
dipole: 1.9069667 1.186101 -1.1680374 debye
polarizability: 267.9735615|8.9782401|122.4155563|2.6059972|-44.1560243|136.2289923 unknown
InChI: InChI=1S/C13H16N2O/c1-11-4-6-12(7-5-11)13(16)10-14-15-8-2-3-9-15/h4-7,10H,2-3,8-9H2,1H3
charge 0 multiplicity 1
32 atoms
O  -0.744384 -1.712532 2.368508
N  2.745985 0.417594 0.141441
N  1.422673 0.223024 0.259948
C  4.710665 1.617175 -0.405634
C  5.118285 0.271721 0.259669
C  3.262742 1.360769 -0.878535
C  3.821584 -0.221029 0.947592
C  0.951081 -0.613006 1.186338
C  -0.479899 -0.894158 1.414735
C  -1.610818 -0.294628 0.620015
C  -3.901319 0.730229 -0.773491
C  -1.454061 0.590929 -0.481286
C  -2.930067 -0.660091 1.008851
C  -2.584872 1.088286 -1.16266
C  -4.051865 -0.158265 0.32499
C  -5.112714 1.296388 -1.492308
H  4.726602 2.432051 0.340588
H  5.379071 1.897695 -1.236166
H  5.43361 -0.45321 -0.512392
H  5.948095 0.387105 0.976259
H  2.635059 2.267085 -0.902712
H  3.239253 0.894846 -1.884699
H  3.72072 -1.323915 0.931454
H  3.750584 0.107951 2.005325
H  1.602563 -1.168989 1.880907
H  -0.447999 0.877936 -0.793727
H  -3.039068 -1.347886 1.854162
H  -2.444969 1.766538 -2.013984
H  -5.059283 -0.456669 0.640836
H  -4.880316 1.550043 -2.541595
H  -5.956216 0.583411 -1.488861
H  -5.466621 2.223799 -1.000368
