program: Gaussian 09
title: 000033060
version: EM64L-G09RevD.01
frameworkgroup: C1[X(C13H16N2O2)]
method: RPBEPBE
basis: SDD
operation: Freq
keyword: #p
keyword: freq=noraman
keyword: PBEPBE/SDD
title: #p freq=noraman PBEPBE/SDD
converged: YES YES NO NO
title: Mulliken charges:
elementType: O O N N C C C C C C C C C C C C C H H H H H H H H H H H H H H H H
charge: -0.263547 -0.260104 -0.129956 0.020114 -0.443935 -0.458032 -0.340522 -0.363207 -0.369536 0.070314 0.272632 -0.322484 -0.338068 0.323558 -0.367032 -0.362023 -0.537159 0.232977 0.231668 0.232266 0.235389 0.246407 0.227538 0.245561 0.241843 0.232871 0.287880 0.280330 0.235041 0.249807 0.245337 0.222074 0.221999
chargesum: 0.00000
title: Mulliken charges with hydrogens summed into heavy atoms:
elementType: O O N N C C C C C C C C C C C C C
charge: -0.263547 -0.260104 -0.129956 0.020114 0.020710 0.009623 0.133423 0.124197 -0.136664 0.070314 0.272632 -0.034605 -0.057738 0.323558 -0.131991 -0.112216 0.152251
polarizability: 2.78734110e+02 -2.63333015e+00 1.87835223e+02 7.01834566e-01 -1.26838622e+00 8.58654533e+01
1716.lowfreq: -10.2150 -7.9462 -1.4143 -0.0001 0.0006 0.0007 19.5900 34.6015 56.4176
frequency: 19.2249 34.5455 56.3801 65.2679 77.2894 131.9918 148.0575 158.8761 195.7391 203.0214 221.3197 237.7526 259.9569 305.4920 341.2854 361.3386 385.7800 416.7124 468.8099 506.7486 531.7079 569.4428 579.8059 627.1967 662.9194 678.3932 709.6932 762.2899 787.2073 803.0093 825.5750 852.6533 853.9861 857.4627 894.0052 906.0145 926.3218 981.7130 983.2568 986.2180 1000.0898 1001.3556 1058.0712 1082.3050 1104.6793 1109.9864 1111.8699 1151.3611 1154.7730 1159.0242 1173.0199 1179.1743 1208.6022 1230.5441 1235.2572 1248.0252 1296.2657 1301.7569 1304.7099 1311.1008 1330.7899 1335.4484 1370.8457 1383.5072 1425.4274 1435.9699 1466.7201 1470.2720 1471.7928 1473.6213 1484.9500 1492.9241 1496.4696 1499.5298 1529.8447 1577.6048 1616.6245 2957.6270 2961.1380 2969.9775 3007.1397 3015.8417 3022.0482 3049.7964 3055.5892 3065.3601 3082.9378 3096.9332 3125.5390 3149.3555 3150.5095 3169.4988 3177.6073
redmass: 3.3872 3.1073 4.6760 3.7161 4.2087 4.4576 4.5717 2.6085 4.1550 3.1162 1.2699 1.9543 3.9029 3.6867 7.4892 3.6774 5.6382 3.0176 4.4716 2.9761 6.5005 1.9281 5.8095 6.8808 5.3357 3.6176 4.1883 4.0020 3.7910 2.9018 1.2927 1.9388 1.8356 1.6406 1.5640 2.5838 1.3780 1.7124 1.3772 8.2677 1.3472 2.9261 1.9835 3.3940 1.5015 1.3319 1.2609 1.3714 1.3327 1.6298 2.8009 1.3064 1.4118 2.8591 2.1879 1.5662 1.5157 1.3365 1.5489 1.2519 1.3860 1.6356 4.3391 4.4581 4.2723 1.1833 1.0500 1.0897 1.0761 1.0996 1.0992 1.1575 2.7312 5.1825 4.9106 7.4475 6.3283 1.0597 1.0328 1.0674 1.0896 1.0631 1.0761 1.1039 1.0867 1.0962 1.1012 1.1055 1.0995 1.0879 1.0885 1.0965 1.0953
irintensity: 0.2385 1.0074 1.2067 0.4794 0.1699 5.5051 0.1358 7.5555 2.0158 2.3826 0.0389 1.1628 11.1495 3.1937 0.0256 1.4105 26.8596 0.0256 0.5514 11.2437 1.1224 2.5665 42.7574 1.2581 5.3640 8.9882 16.7914 5.9242 7.3773 27.4441 10.9038 38.6132 4.8588 62.3921 25.9222 5.8540 2.5796 11.6426 1.6009 48.9929 0.4491 7.0299 12.1324 37.4021 5.9826 21.9323 0.2996 28.1967 7.9141 5.0881 2.9755 222.9035 38.2674 118.0853 129.5835 38.4580 192.7219 13.1074 204.0367 16.4604 22.5571 13.2169 4.7180 79.1451 49.9982 4.6935 13.3086 14.6340 45.5505 38.3304 13.2863 26.4730 3.3461 176.9103 312.6762 66.2435 167.9306 38.4689 65.2251 50.0633 10.4378 28.3546 50.1783 48.2178 41.9720 23.1411 31.4882 52.8656 27.6293 1.2274 7.7463 9.0572 19.8970
temp: 298.150 k
press: 1.00000 atm
elementType: 8 8 7 7 6 6 6 6 6 6 6 6 6 6 6 6 6 1 1 1 1 1 1 1 1 1 1 1 1 1 1 1 1
symmnumber: 1
zpe: 704096.1 jmol-1
zpe.correction: 0.268176 hartree
zpe.thermalcorrener: 0.284325 hartree
zpe.thermalcorrenthalpy: 0.285269 hartree
zpe.thermalcorrgfe: 0.222449 hartree
zpe.sumelectzpe: -763.621582 hartree
zpe.sumelectthermal: -763.605433 hartree
zpe.sumelectthermalent: -763.604489 hartree
zpe.sumelectthermalfe: -763.667309 hartree
dipole: 4.6895 -6.3461 0.1031
dipole: 7.8914
quadrupole: -71.3092 -102.0495 -102.6247
quadrupole: 5.8628 0.1305 0.1544
quadrupole: 20.6853 -10.0551 -10.6302 5.8628 0.1305 0.1544
hfenergy: -763.8897578 hartree
pointgroup: C01 [X(C13H16N2O2)]
dipole: 1.9289027 -2.0000762 1.3850466 debye
polarizability: 278.0742642|-6.7623355|150.3538007|-9.7941143|-48.8527695|124.0067208 unknown
InChI: InChI=1S/C13H16N2O2/c1-17-12-6-4-11(5-7-12)13(16)10-14-15-8-2-3-9-15/h4-7,10H,2-3,8-9H2,1H3
charge 0 multiplicity 1
33 atoms
O  -0.16752 2.287215 -2.111213
O  -4.912885 -0.905922 0.747047
N  3.011732 -0.511348 -0.174275
N  1.714807 -0.192328 -0.321316
C  4.857856 -1.922199 0.274447
C  5.39025 -0.513247 -0.114154
C  3.394395 -1.653378 0.689142
C  4.179337 0.180869 -0.784013
C  1.362697 0.832527 -1.098314
C  -0.027474 1.273823 -1.333149
C  -1.243729 0.628283 -0.733915
C  -1.22591 -0.500973 0.126899
C  -2.50705 1.203615 -1.065069
C  -3.665184 -0.454005 0.297794
C  -2.422666 -1.043383 0.641902
C  -3.702265 0.676437 -0.560582
C  -4.936295 -2.073396 1.632048
H  4.886987 -2.596636 -0.600416
H  5.443987 -2.38551 1.08514
H  5.68734 0.04299 0.793122
H  6.263577 -0.56045 -0.785321
H  2.717924 -2.505049 0.506433
H  3.318953 -1.372797 1.759438
H  4.141338 1.268435 -0.577045
H  4.168719 0.047791 -1.885865
H  2.094632 1.450894 -1.644263
H  -0.266137 -0.950631 0.390256
H  -2.511031 2.073856 -1.729437
H  -2.375686 -1.91464 1.302458
H  -4.673766 1.113389 -0.810807
H  -6.000354 -2.247962 1.848652
H  -4.390771 -1.874487 2.574867
H  -4.505208 -2.963681 1.134411
