program: Gaussian 09
title: 000033016
version: EM64L-G09RevD.01
frameworkgroup: C1[X(C6H13Cl)]
method: RPBEPBE
basis: SDD
operation: Freq
keyword: #pfreq=noraman
keyword: PBEPBE/SDD
title: #p freq=noraman PBEPBE/SDD
converged: YES YES NO NO
title: Mulliken charges:
elementType: Cl C C C C C C H H H H H H H H H H H H H
charge: -0.115978 -0.304845 -0.318044 -0.329842 -0.343951 -0.681294 -0.693429 0.249757 0.219934 0.185733 0.194483 0.223989 0.224161 0.190054 0.206243 0.215414 0.238235 0.220188 0.213450 0.205741
chargesum: 0.00000
title: Mulliken charges with hydrogens summed into heavy atoms:
elementType: Cl C C C C C C
charge: -0.115978 -0.055087 0.087623 0.088630 0.070265 -0.021403 -0.054050
polarizability: 8.47733346e+01 -6.35326272e-01 7.74327792e+01 1.07855602e-02 -1.19150251e+00 6.02077918e+01
1716.lowfreq: -4.7098 0.0018 0.0022 0.0026 12.2908 17.3646 70.0373 85.3645 111.1213
frequency: 70.0057 85.2524 111.0883 139.4080 200.7351 229.5141 238.0929 291.0384 339.6006 398.6534 493.3860 542.4527 737.1491 783.8523 867.1008 889.5401 897.5050 1014.7984 1031.8683 1049.4719 1068.7426 1096.9555 1125.1123 1140.8580 1205.8844 1229.1067 1252.4491 1275.0524 1303.2015 1309.6811 1352.2613 1360.5474 1390.4864 1391.9788 1440.3184 1453.4309 1472.4387 1474.2507 1479.3576 1485.5279 1486.0594 2953.4632 2967.0690 2973.2855 2977.7548 2983.4356 3018.0753 3026.8982 3041.0929 3053.7891 3072.5075 3076.1307 3077.5089 3095.1068
redmass: 2.1488 2.0080 2.0330 2.7602 1.5167 1.5765 1.3833 2.9743 3.0530 3.1431 2.6291 3.4302 1.1194 1.2066 1.2781 2.2097 1.6828 1.7717 2.0337 1.8072 1.5573 2.0995 2.0770 2.3973 1.3835 1.3187 1.2278 1.1433 1.1343 1.2944 1.5162 1.7051 1.2105 1.2178 1.0804 1.0764 1.0416 1.0551 1.0420 1.0776 1.0522 1.0630 1.0622 1.0361 1.0645 1.0374 1.0912 1.0934 1.0977 1.0932 1.1010 1.0989 1.0990 1.0998
irintensity: 0.2951 0.0070 0.8912 0.2438 1.5907 0.5316 0.3147 0.9748 2.0114 3.7374 0.8657 23.3341 5.1123 26.4589 6.6404 12.3300 8.0543 3.1737 0.8059 9.3730 3.1681 2.8699 3.6461 5.2515 9.4948 1.4605 2.5089 6.3228 6.2671 0.9404 1.2436 1.8860 27.2072 0.7458 0.3021 10.3423 13.0853 4.0428 12.8122 14.1171 13.2766 11.9161 39.4704 47.5073 28.5105 29.2635 4.7576 1.7692 1.0543 22.3201 74.1695 43.6288 72.5210 28.0977
temp: 298.150 k
press: 1.00000 atm
elementType: 17 6 6 6 6 6 6 1 1 1 1 1 1 1 1 1 1 1 1 1
symmnumber: 1
zpe: 463674.5 jmol-1
zpe.correction: 0.176604 hartree
zpe.thermalcorrener: 0.186187 hartree
zpe.thermalcorrenthalpy: 0.187131 hartree
zpe.thermalcorrgfe: 0.141602 hartree
zpe.sumelectzpe: -695.906968 hartree
zpe.sumelectthermal: -695.897386 hartree
zpe.sumelectthermalent: -695.896442 hartree
zpe.sumelectthermalfe: -695.941970 hartree
dipole: 0.4753 -2.4605 0.3136
dipole: 2.5255
quadrupole: -51.8828 -54.3342 -51.6716
quadrupole: 2.0893 0.1306 -0.1434
quadrupole: 0.7467 -1.7047 0.9579 2.0893 0.1306 -0.1434
hfenergy: -696.0835728 hartree
pointgroup: C01 [X(C6H13Cl1)]
dipole: 0.132383 0.9389321 -0.2969219 debye
dipolederiv: -0.3271442 -0.0422739 0.0114758 -0.0480023 -0.6629337 0.0914842 0.0224616 0.1475547 -0.2379297 0.2708531 0.0609705 -0.0222344 0.088486 0.8212684 -0.1869072 -0.0113201 -0.1722674 0.2794447 -0.1211868 0.0118566 -0.021516 -0.0462009 -0.0285471 -0.012404 -0.00243 -0.0124902 0.0830239 -0.0342198 -0.0191139 0.0238207 0.0284911 -0.0349638 -0.008909 -0.0005076 0.0081176 0.0848758 0.0314599 0.0010342 -0.0127036 -0.0447525 0.0600469 -0.0226094 -0.0250536 -0.0309914 0.1579053 -0.0796626 -0.0331728 -0.0184786 0.0027908 0.0303271 -0.0058318 -0.0095368 -0.012264 0.0855991 -0.0613101 -0.0291322 -0.0163697 -0.0024805 0.0878768 -0.0256717 0.0039184 -0.0228072 0.0777549 0.0489915 -0.0074416 0.0022702 -0.0151981 -0.0429863 0.0100142 -0.004887 0.0003435 -0.1379097 0.0448382 -0.0007343 0.0061633 0.019731 0.0871978 -0.0067883 -0.0007051 -0.0424068 -0.1432265 0.0348332 -0.036505 0.0105977 0.0156489 -0.166473 0.0604175 -0.0094852 0.067348 0.0648835 0.0155431 -0.0291707 0.0129702 -0.0594151 -0.1579073 0.0653554 0.0283183 0.0673143 0.0706859 0.0331073 0.0082207 -0.0450428 -0.0072696 0.0941656 -0.0046655 -0.019168 -0.0495058 -0.1443147 0.0675117 -0.0308945 0.0037187 0.0120559 -0.116788 0.0344661 -0.0039637 0.063996 0.0630269 0.0166147 0.0001255 -0.0516163 0.0055762 0.0730535 -0.0021355 -0.0162087 -0.0325125 -0.2001886 0.0664941 -0.013306 0.0272127 -0.0197443 0.0907754 -0.0094533 -0.0437247 -0.0114122 -0.1823479 -0.1088917 0.1108506 0.0377518 0.1446542 -0.0034127 -0.0531899 0.0547276 -0.0610974 0.0722676 0.1021241 -0.0253858 -0.0036082 -0.0985005 -0.0747644 0.0578465 0.0150256 0.0738832 0.065277 -0.1456994 0.0788241 0.0673371 0.1151067 0.0285619 -0.0539538 0.087615 -0.0519493 0.0619426 0.0768312 -0.0124923 0.005459 -0.0231763 0.0818926 0.0026612 -0.060365 -0.0120347 -0.1810348 0.0689123 0.007741 -0.0172073 -0.0678005 -0.1663897 0.0702744 -0.004711 0.0831816 0.0602646 unknown
polarizability: 84.6802872|1.0032642|76.5497683|-0.2513682|-4.1687881|61.1838502 unknown
InChI: InChI=1S/C6H13Cl/c1-3-5-6(7)4-2/h6H,3-5H2,1-2H3
charge 0 multiplicity 1
20 atoms
Cl -0.76665 -1.796525 0.526369
C  -0.56413 -0.019402 -0.205943
C  0.806972 0.521003 0.219804
C  -1.753636 0.830015 0.262946
C  2.017976 -0.247627 -0.351924
C  -3.127552 0.345332 -0.240531
C  3.362735 0.371301 0.085164
H  -0.606787 -0.20919 -1.293459
H  0.859048 0.542392 1.326245
H  0.856923 1.579167 -0.119041
H  -1.56999 1.863652 -0.100662
H  -1.744002 0.878311 1.368806
H  1.963112 -1.301762 -0.021478
H  1.954388 -0.259557 -1.459275
H  -3.158523 0.311851 -1.345938
H  -3.930684 1.0226 0.101272
H  -3.345618 -0.668415 0.136723
H  4.216913 -0.193608 -0.330037
H  3.460589 0.367037 1.18714
H  3.453817 1.420125 -0.256181
