program: Gaussian 09
title: 000033039
version: EM64L-G09RevD.01
frameworkgroup: C1[X(C10H13FN2O4)]
method: RPBEPBE
basis: SDD
operation: Freq
keyword: #p
keyword: freq=noraman
keyword: PBEPBE/SDD
title: #p freq=noraman PBEPBE/SDD
converged: YES YES NO NO
title: Mulliken charges:
elementType: F O O O O N N C C C C C C C C C C H H H H H H H H H H H H H
charge: -0.216866 -0.259249 -0.441235 -0.269223 -0.247334 -0.193016 -0.396577 -0.021898 -0.518470 -0.036720 -0.076957 -0.370292 -0.232775 0.200471 0.226378 0.087972 -0.771384 0.292596 0.248563 0.302715 0.214861 0.290641 0.216730 0.217075 0.333439 0.358492 0.356152 0.216220 0.248999 0.240691
chargesum: 0.00000
title: Mulliken charges with hydrogens summed into heavy atoms:
elementType: F O O O O N N C C C C C C C C C C
charge: -0.216866 -0.259249 -0.085083 -0.269223 -0.247334 -0.193016 -0.038085 0.270699 0.032808 0.178141 0.213684 0.063514 0.100664 0.200471 0.226378 0.087972 -0.065474
polarizability: 1.71510055e+02 1.33624800e+01 1.42163969e+02 6.01571278e+00 -1.48986150e+00 8.50483399e+01
1716.lowfreq: -13.3556 -7.4284 -0.0009 -0.0005 -0.0005 5.2845 35.0144 41.2008 70.3002
frequency: 34.5026 40.9454 70.2435 84.3674 118.1574 123.0346 136.0575 162.6742 183.5447 194.2362 236.5558 272.9759 274.1128 296.4794 317.8484 322.3704 375.7626 383.2607 421.8861 442.5324 465.4457 503.6665 548.0185 613.7126 663.2524 704.5542 715.1503 717.9337 740.7383 761.7319 777.3504 807.3066 820.7075 845.3007 932.2124 937.8808 943.6854 966.7771 983.3577 1010.4010 1032.4179 1052.8979 1056.4658 1069.3492 1072.4699 1089.0076 1134.4532 1174.9201 1197.0118 1224.3331 1227.3188 1239.6308 1246.5597 1258.8952 1281.4416 1301.0923 1325.8630 1337.7131 1345.5998 1359.3334 1368.9410 1402.9460 1410.6682 1419.4642 1439.1462 1452.8353 1472.1888 1473.6287 1612.3522 1626.8299 1655.9860 2941.1430 2985.1797 2992.9459 3044.3813 3060.8354 3064.4904 3065.6169 3093.4972 3096.0773 3128.4901 3154.8642 3524.1661 3574.2851
redmass: 4.1023 7.1560 6.6042 4.7610 5.1267 3.2199 1.1861 5.0308 6.0965 3.7227 4.9373 1.3249 2.7336 3.4405 5.1860 7.4841 7.5602 7.4062 3.5296 2.8732 6.6627 3.1341 5.5755 4.7884 4.1855 2.0991 5.9943 5.5736 6.6439 4.5542 2.2819 3.3584 3.4892 3.5763 2.5238 2.9565 1.3755 4.1669 2.0503 1.8154 3.8753 2.2508 1.9294 2.3864 1.9851 3.1401 5.7512 1.3129 1.1485 3.4857 1.2616 1.7984 1.2809 2.1343 1.3149 1.5166 1.4183 1.5639 1.2588 1.5652 1.7482 1.5549 2.8294 1.4202 1.0839 1.0440 1.0784 1.0758 5.5367 10.4807 5.7802 1.0549 1.0363 1.1062 1.0704 1.0824 1.0974 1.0886 1.0885 1.1005 1.1002 1.0950 1.0770 1.0667
irintensity: 6.9745 0.9241 3.9518 1.8954 5.5610 1.1437 0.3540 9.7049 4.9099 18.7709 2.5639 115.7644 33.0786 29.7801 4.7750 4.7036 6.4588 8.0819 6.6903 16.0724 9.2095 30.7308 14.8003 0.1644 8.6923 9.1905 7.6438 11.1006 11.1923 2.4842 109.8099 12.6830 1.9444 26.8288 12.8256 55.5411 14.6027 64.2950 19.0376 10.2367 42.2011 45.8952 64.5927 25.2204 38.5841 29.3550 16.3907 10.9191 35.6768 11.6646 3.3409 10.4512 8.3418 207.3016 6.0931 43.6472 21.2819 41.5664 4.6938 1.3374 11.2525 64.6503 45.4554 1.1530 18.5935 11.3173 6.8910 4.0801 189.2362 289.0819 564.4882 43.2049 23.5528 55.6200 5.4130 36.8306 15.3079 5.5363 14.5673 14.9534 2.7750 30.8191 55.0340 8.7268
temp: 298.150 k
press: 1.00000 atm
elementType: 9 8 8 8 8 7 7 6 6 6 6 6 6 6 6 6 6 1 1 1 1 1 1 1 1 1 1 1 1 1
symmnumber: 1
zpe: 604344.2 jmol-1
zpe.correction: 0.230183 hartree
zpe.thermalcorrener: 0.246420 hartree
zpe.thermalcorrenthalpy: 0.247364 hartree
zpe.thermalcorrgfe: 0.185827 hartree
zpe.sumelectzpe: -897.829457 hartree
zpe.sumelectthermal: -897.813220 hartree
zpe.sumelectthermalent: -897.812276 hartree
zpe.sumelectthermalfe: -897.873812 hartree
dipole: -3.1890 3.5518 3.3594
dipole: 5.8370
quadrupole: -121.9728 -97.2608 -96.3804
quadrupole: -4.1287 -11.9266 5.7641
quadrupole: -16.7681 7.9438 8.8243 -4.1287 -11.9266 5.7641
hfenergy: -898.0596392 hartree
pointgroup: C01 [X(C10H13F1N2O4)]
dipole: -1.5051393 -1.2926715 -1.1564194 debye
polarizability: 166.435272|-17.4556697|146.0424183|-9.7956489|-3.5284739|86.2446742 unknown
InChI: InChI=1S/C10H13FN2O4/c1-5-3-13(10(16)12-9(5)15)8-2-6(11)7(4-14)17-8/h3,6-8,12,14H,2,4H2,1H3
charge 0 multiplicity 1
30 atoms
F  -4.090355 1.513803 0.20885
O  -1.722554 -0.169964 1.132161
O  -1.955235 -2.814425 0.061717
O  0.96025 2.661964 -0.382698
O  4.254523 -0.644572 -0.795494
N  0.405716 0.4477 0.164713
N  2.577012 0.966919 -0.584709
C  -0.964493 0.938963 0.575569
C  -1.784376 1.503281 -0.620234
C  -3.119077 0.74231 -0.571577
C  -2.801715 -0.556615 0.18619
C  -2.380776 -1.684393 -0.769777
C  0.798669 -0.883762 0.334897
C  1.298588 1.446279 -0.275391
C  2.06618 -1.331221 0.032551
C  3.060217 -0.374313 -0.473778
C  2.494069 -2.767032 0.214422
H  -0.814522 1.685372 1.372138
H  -1.260565 1.323856 -1.573969
H  -1.941727 2.586997 -0.524078
H  -3.582848 0.584956 -1.561301
H  -3.642007 -0.890938 0.815185
H  -1.557952 -1.353613 -1.439732
H  -3.260264 -1.95242 -1.394046
H  0.019671 -1.543455 0.729445
H  3.24827 1.668242 -0.914267
H  -1.793646 -3.605198 -0.511447
H  1.667159 -3.383374 0.606346
H  3.347465 -2.8345 0.913371
H  2.843219 -3.198644 -0.741558
