program: Gaussian 09
title: 000033024
version: EM64L-G09RevD.01
frameworkgroup: C1[X(C8H9N3O2)]
method: RPBEPBE
basis: SDD
operation: Freq
keyword: #pfreq=noraman
keyword: PBEPBE/SDD
title: #p freq=noraman PBEPBE/SDD
converged: NO NO NO NO
title: Mulliken charges:
elementType: O O N N N C C C C C C C C H H H H H H H H H
charge: -0.204978 -0.240744 -0.225475 -0.016540 0.006375 -0.012000 -0.010829 0.100023 0.280235 0.193789 -0.752087 -0.766295 -0.592672 0.227564 0.262351 0.227585 0.248473 0.267605 0.248456 0.244402 0.244400 0.270362
chargesum: 0.00000
title: Mulliken charges with hydrogens summed into heavy atoms:
elementType: O O N N N C C C C C C C C
charge: -0.204978 -0.240744 -0.225475 -0.016540 0.006375 -0.012000 -0.010829 0.100023 0.280235 0.193789 -0.034587 -0.001760 0.166491
polarizability: 1.60745093e+02 -7.23158204e+00 1.25630773e+02 1.13663831e-02 6.75366769e-03 6.02706260e+01
1716.lowfreq: -56.7762 -6.0828 -0.0002 0.0003 0.0007 12.0540 16.7967 72.7668 86.3352
frequency: -56.7138 72.7630 86.2942 112.0450 148.4222 172.2762 195.7948 239.7847 278.1220 298.9535 338.9517 348.6175 375.5503 423.4974 487.8284 542.3515 570.8292 584.1477 629.8538 660.5733 670.5253 745.0925 770.0706 811.2021 907.4550 924.3086 951.1287 1030.9686 1038.1815 1042.6772 1055.0998 1108.2849 1126.6132 1192.1922 1209.2214 1264.4922 1333.6834 1391.8048 1401.7339 1404.5050 1418.0709 1442.0124 1454.6870 1456.3022 1465.4551 1467.7205 1475.3835 1478.6803 1526.2405 1600.3596 1612.6267 2977.4217 2990.8555 3007.9255 3053.3257 3071.6618 3099.8185 3108.6147 3114.3263 3138.5846
redmass: 1.0325 3.3091 1.0788 4.7296 1.1992 2.5158 3.1267 5.4553 2.6807 6.4303 3.7465 6.0975 4.8690 5.7673 7.5733 5.9240 7.2272 8.4239 4.0414 6.4363 7.3657 6.9967 9.1256 12.3712 4.2278 2.4097 3.1603 1.4430 1.9246 1.4840 5.8636 3.6014 1.3064 3.4525 3.8554 4.6703 7.7196 1.5490 1.3299 3.2361 1.2144 2.3099 1.8050 1.0451 1.1333 1.0456 1.0566 1.0444 3.9323 10.1799 10.9994 1.0383 1.0373 1.0334 1.0978 1.0981 1.1026 1.0986 1.0975 1.1011
irintensity: 0.1309 2.4996 0.0052 0.3395 2.3008 0.0955 0.5857 1.9617 2.8747 7.1772 0.0464 7.7002 0.2906 11.4691 2.1525 4.9847 1.3640 1.0581 7.7591 13.2871 4.2092 5.1540 1.5334 9.1935 15.5116 8.7831 18.0993 1.5119 32.3611 5.7763 8.3095 59.6029 0.3406 13.6615 27.8385 23.4552 40.2832 5.0345 6.7922 11.6169 38.3351 69.4428 24.4911 5.2906 13.1286 37.4817 23.2715 18.9461 19.0432 26.2650 254.5139 19.1732 9.9638 38.8503 16.3597 8.5815 20.2607 5.8921 6.4047 0.3245
temp: 298.150 k
press: 1.00000 atm
elementType: 8 8 7 7 7 6 6 6 6 6 6 6 6 1 1 1 1 1 1 1 1 1
symmnumber: 1
zpe: 430093.2 jmol-1
zpe.correction: 0.163814 hartree
zpe.thermalcorrener: 0.175340 hartree
zpe.thermalcorrenthalpy: 0.176284 hartree
zpe.thermalcorrgfe: 0.126363 hartree
zpe.sumelectzpe: -623.947608 hartree
zpe.sumelectthermal: -623.936082 hartree
zpe.sumelectthermalent: -623.935138 hartree
zpe.sumelectthermalfe: -623.985059 hartree
dipole: -3.3732 5.8197 0.0000
dipole: 6.7266
quadrupole: -63.7467 -89.0910 -74.5156
quadrupole: 0.1489 -0.0001 -0.0009
quadrupole: 12.0377 -13.3066 1.2688 0.1489 -0.0001 -0.0009
hfenergy: -624.1114219 hartree
pointgroup: C01 [X(C8H9N3O2)]
dipole: -1.2508682 -2.3321842 -0.0000097 debye
dipolederiv: -0.4748535 0.1586764 0.000057 0.2788932 -0.2463172 -0.0000266 0.000126 -0.0000313 -0.1491954 -0.734526 -0.4322991 0.0000514 -0.4058868 -1.0432268 0.0000275 -0.0000104 -0.0000115 -0.3399771 -0.3187467 0.2965044 0.0001438 -0.8261814 -0.866241 0.0000044 -0.0002207 0.000091 -0.1681444 0.0153886 0.1000996 -0.0000501 0.7885683 -0.0270412 -0.0000474 0.0001322 -0.0000475 -0.160523 -0.007697 -0.0039418 -0.0000103 -0.0348408 -0.1744779 -0.00002 0.0000034 -0.0000038 -0.1265102 -0.4719383 -0.1890327 0.0000443 -0.0938538 -0.242568 -0.0000305 0.000055 -0.0000265 0.0103636 -0.1834327 -0.1131142 0.000003 0.1098247 0.1188606 0.0000188 0.0000657 0.0000049 0.0588017 0.1737269 0.1012029 0.00003 -0.0615476 0.4636289 0.0001032 -0.0000284 0.0001025 0.0252992 0.747079 0.0670421 -0.0001037 -0.0634514 0.2756186 0.0000177 -0.0003104 -0.0000275 0.0688769 0.7185257 0.1997135 -0.000126 0.4984965 1.4940176 -0.0000461 -0.0001441 0.000037 0.2389253 -0.0765339 -0.1006745 -0.0000239 -0.0239516 -0.1125358 -0.0000321 -0.0000684 -0.0000485 0.067342 -0.1431331 -0.0630588 0.0000239 -0.1729739 -0.0604079 0.0000089 0.0002262 0.0000586 0.0599094 0.4666617 -0.1215235 -0.0001884 -0.046349 0.0269164 0.0000019 -0.0000851 -0.0001494 0.201094 0.0052281 -0.0641638 0.110091 -0.0373608 0.0613323 -0.0282899 0.118523 0.0226774 -0.0379871 0.0325061 0.1460726 -0.0000157 0.0457314 -0.007576 0.0000127 0.0000022 0.0000274 0.1212019 0.0053213 -0.0641628 -0.1100678 -0.0373817 0.0613251 0.0282792 -0.1184869 -0.0226822 -0.0380668 0.0402903 -0.0225228 -0.0280198 -0.047935 0.0530372 0.0928042 0.0189295 0.0949867 -0.0058148 0.0172838 0.0444471 -0.0000238 0.125124 0.0211302 0.0000423 -0.0000714 0.0000218 0.1377931 0.0403849 -0.022496 0.0280563 -0.0479119 0.052914 -0.0928402 -0.0189115 -0.0950411 -0.0057036 0.0244457 0.0422007 0.003453 0.0961584 0.0632189 -0.0979966 0.0733214 -0.0904682 -0.046864 0.024738 0.0421109 -0.003307 0.096248 0.0629189 0.0982367 -0.0730292 0.0906537 -0.0463842 0.0992808 -0.0010802 -0.0000171 -0.139419 0.025473 -0.0002282 -0.0000179 -0.0001236 0.1355636 unknown
polarizability: 160.2300536|8.3735163|126.145812|-0.011583|0.0063751|60.270626 unknown
InChI: InChI=1S/C8H9N3O2/c1-4-6-5(2)13-10-7(6)8(12)11(3)9-4/h1-3H3
charge 0 multiplicity 1
22 atoms
O  -2.12285 1.592888 0.000743
O  2.24913 1.946262 0.000155
N  1.961131 -0.395076 0.000146
N  1.21714 -1.583084 0.000059
N  -0.755309 2.112542 0.000601
C  -0.789211 -0.233802 0.000372
C  -0.002775 0.980737 0.000394
C  -0.117025 -1.518416 0.000072
C  -2.121672 0.190662 0.000542
C  1.473523 0.947862 0.000131
C  -0.861603 -2.83215 -0.000107
C  -3.460526 -0.471449 0.000727
C  3.418846 -0.626564 0.000138
H  -1.50891 -2.92884 0.89222
H  -0.137505 -3.661823 0.000026
H  -1.508485 -2.928797 -0.892748
H  -3.591611 -1.110195 0.892747
H  -4.254864 0.292623 0.000455
H  -3.591573 -1.11083 -0.890834
H  3.704951 -1.198504 -0.898225
H  3.704528 -1.200583 0.897286
H  3.919172 0.352737 0.001301
