program: Gaussian 09
title: 000033061
version: EM64L-G09RevD.01
frameworkgroup: C1[X(C12H13ClN2O)]
method: RPBEPBE
basis: SDD
operation: Freq
keyword: #p
keyword: freq=noraman
keyword: PBEPBE/SDD
title: #p freq=noraman PBEPBE/SDD
converged: YES YES NO NO
title: Mulliken charges:
elementType: Cl O N N C C C C C C C C C C C C H H H H H H H H H H H H H
charge: -0.062172 -0.256440 -0.126469 0.017700 -0.443426 -0.458241 -0.342288 -0.364144 -0.364028 0.082911 0.276458 -0.308010 -0.335993 -0.229863 -0.226789 -0.094597 0.234666 0.234308 0.233963 0.237440 0.249904 0.231006 0.247841 0.244381 0.236264 0.294527 0.284227 0.251131 0.255730
chargesum: 0.00000
title: Mulliken charges with hydrogens summed into heavy atoms:
elementType: Cl O N N C C C C C C C C C C C C
charge: -0.062172 -0.256440 -0.126469 0.017700 0.025549 0.013162 0.138622 0.128079 -0.127764 0.082911 0.276458 -0.013483 -0.051766 0.021268 0.028941 -0.094597
polarizability: 2.72978267e+02 7.26666241e+00 1.73728834e+02 1.65365527e+00 2.12535150e+00 7.67849805e+01
1716.lowfreq: -9.7726 -7.2100 -2.2328 0.0014 0.0024 0.0025 18.9905 32.1605 58.1687
frequency: 18.6716 31.9767 58.1614 65.5011 90.6194 152.8160 158.4140 193.8166 202.8101 235.9969 270.2170 301.1240 316.1010 364.7718 379.0942 409.5255 473.7388 497.1793 532.6948 569.9270 622.4358 631.7378 669.0074 688.7325 744.8419 757.8762 798.3100 841.5192 850.5151 854.4122 855.2733 892.6537 906.7533 926.6155 981.9067 989.2020 996.2255 999.2392 1058.5628 1068.8247 1081.0691 1102.9293 1104.4954 1152.0911 1159.7486 1171.6705 1180.4846 1209.0152 1234.1268 1249.6372 1290.1333 1299.6576 1303.8742 1311.7389 1331.7698 1335.5613 1367.2210 1383.2556 1395.8660 1470.0258 1470.5229 1473.1311 1483.2766 1492.1308 1504.4019 1527.8922 1581.0736 1592.5197 2960.7920 2974.1556 3010.1450 3017.8157 3024.2754 3061.5126 3070.7102 3084.8647 3099.0351 3152.4698 3159.2383 3172.5307 3181.9326
redmass: 3.6833 3.1856 5.9411 3.8043 9.4669 6.0950 2.8245 6.2058 2.8267 2.4014 4.7026 6.7987 8.3369 3.4305 6.0106 2.9574 3.4611 7.8161 6.8434 1.9298 7.0055 5.8294 4.2326 4.8038 3.4008 4.7318 2.3943 1.2481 1.8687 1.8301 1.6453 1.5788 2.5695 1.3738 1.7476 1.3513 1.3535 4.5412 2.0362 3.3769 2.8659 1.4512 1.3911 1.4284 1.6453 2.6020 1.1475 1.4053 2.0029 1.6141 1.2706 1.6612 1.4620 1.2459 1.3826 1.6189 4.7099 4.2329 4.3332 2.3971 1.0929 1.1100 1.0961 1.1211 8.0868 4.7903 7.8261 6.2911 1.0597 1.0673 1.0858 1.0631 1.0800 1.0869 1.0965 1.1013 1.1054 1.0884 1.0900 1.0964 1.0961
irintensity: 0.1045 0.5546 0.4445 0.2067 2.1249 1.8495 3.2578 3.1988 4.5189 2.3418 0.4256 0.6460 1.8129 3.2115 28.3171 0.0048 14.7296 30.2294 1.9411 2.3529 1.7889 1.7089 6.9601 4.2953 11.0494 58.0378 15.5987 0.4775 49.4170 7.6450 47.2755 24.8395 5.6791 2.3867 10.6295 2.0945 0.4879 49.3143 11.3074 32.9760 34.9691 1.1765 17.5848 16.4410 2.3679 2.8111 54.8480 39.5496 78.4865 34.4881 17.6466 227.5577 131.9758 12.9165 28.4766 9.5824 3.3669 69.8143 22.3915 15.6039 15.4662 52.7289 8.8207 27.8961 95.6142 350.1614 48.6981 73.0851 30.6278 44.2709 10.7072 27.3144 47.0182 35.0400 19.9943 28.5429 50.2085 0.3110 2.3550 4.5757 18.6210
temp: 298.150 k
press: 1.00000 atm
elementType: 17 8 7 7 6 6 6 6 6 6 6 6 6 6 6 6 1 1 1 1 1 1 1 1 1 1 1 1 1
symmnumber: 1
zpe: 596258.3 jmol-1
zpe.correction: 0.227103 hartree
zpe.thermalcorrener: 0.241843 hartree
zpe.thermalcorrenthalpy: 0.242787 hartree
zpe.thermalcorrgfe: 0.182558 hartree
zpe.sumelectzpe: -1108.659501 hartree
zpe.sumelectthermal: -1108.644761 hartree
zpe.sumelectthermalent: -1108.643816 hartree
zpe.sumelectthermalfe: -1108.704046 hartree
dipole: -7.1762 -3.3497 -0.0435
dipole: 7.9196
quadrupole: -79.8565 -107.3383 -102.6225
quadrupole: 8.1558 0.3263 0.1175
quadrupole: 16.7493 -10.7325 -6.0167 8.1558 0.3263 0.1175
hfenergy: -1108.8866039 hartree
pointgroup: C01 [X(C12H13Cl1N2O1)]
dipole: 2.9501063 0.8184264 -0.5790635 debye
polarizability: 270.0100045|17.6761496|103.7613058|18.0694365|-40.9198327|149.7207711 unknown
InChI: InChI=1S/C12H13ClN2O/c13-11-5-3-10(4-6-11)12(16)9-14-15-7-1-2-8-15/h3-6,9H,1-2,7-8H2
charge 0 multiplicity 1
29 atoms
Cl -5.184465 0.739431 -2.35102
O  -0.85993 -1.478513 2.416161
N  2.725109 0.420994 0.123908
N  1.407021 0.182518 0.181127
C  4.679424 1.606003 -0.490666
C  5.084885 0.42828 0.441157
C  3.286881 1.190039 -1.012932
C  3.757285 -0.006123 1.108647
C  0.893376 -0.502036 1.205894
C  -0.537891 -0.809815 1.368924
C  -1.621245 -0.392627 0.403809
C  -1.401708 0.33092 -0.800435
C  -2.951967 -0.76298 0.745674
C  -2.482878 0.67592 -1.640318
C  -4.040455 -0.425106 -0.081235
C  -3.785068 0.293063 -1.266834
H  4.602551 2.543392 0.089115
H  5.401859 1.764911 -1.307854
H  5.496432 -0.404857 -0.156505
H  5.844516 0.719881 1.184829
H  2.627758 2.041326 -1.250658
H  3.364216 0.547017 -1.912824
H  3.7031 -1.098363 1.283385
H  3.584498 0.50003 2.080982
H  1.50622 -0.897499 2.032396
H  -0.384337 0.619463 -1.071513
H  -3.105233 -1.321064 1.67504
H  -2.315402 1.231996 -2.567443
H  -5.061753 -0.711002 0.186088
