program: Gaussian 09
title: 000033029
version: EM64L-G09RevD.01
frameworkgroup: C1[X(C11H7N3O2)]
method: RPBEPBE
basis: SDD
operation: Freq
keyword: #p
keyword: freq=noraman
keyword: PBEPBE/SDD
title: #p freq=noraman PBEPBE/SDD
converged: NO YES NO NO
title: Mulliken charges:
elementType: O O N N N C C C C C C C C C C C H H H H H H H
charge: -0.162972 -0.219838 -0.016015 -0.436046 0.018540 0.150372 0.016161 0.380562 -0.065109 0.188034 -0.245793 -0.369097 -0.397252 -0.226313 -0.233056 -0.235403 0.292900 0.265023 0.233808 0.358826 0.233919 0.232986 0.235765
chargesum: 0.00000
title: Mulliken charges with hydrogens summed into heavy atoms:
elementType: O O N N N C C C C C C C C C C C
charge: -0.162972 -0.219838 -0.016015 -0.077220 0.018540 0.150372 0.016161 0.380562 -0.065109 0.188034 0.047107 -0.104075 -0.163444 0.007606 -0.000070 0.000362
polarizability: 2.33369268e+02 -1.57599794e+01 1.51866174e+02 4.08115975e+00 7.60525197e+00 6.49611443e+01
1716.lowfreq: -7.5356 -3.0062 -0.0011 -0.0010 -0.0008 7.0288 50.3088 63.0289 102.4239
frequency: 50.2469 63.0256 102.4234 144.6589 195.3008 236.7527 256.5674 297.9559 315.0374 374.3029 404.2796 485.1700 502.4528 544.3734 566.6216 588.9140 597.7960 614.9743 642.2712 660.6391 700.8014 727.8789 750.5707 764.3134 776.8193 784.0916 810.5201 854.3335 889.1206 928.2891 941.0831 980.2067 989.9636 1001.0320 1025.9039 1048.3893 1070.0624 1088.6348 1104.6571 1175.6017 1189.2922 1198.4505 1224.6841 1315.5938 1326.4945 1369.0741 1379.6314 1387.3638 1434.3365 1437.1416 1487.3693 1503.6390 1567.3015 1588.0391 1612.5624 1646.0505 3130.1731 3138.4300 3150.4299 3161.8014 3172.7269 3257.4287 3532.6179
redmass: 4.3400 7.5635 5.5963 7.0591 5.4156 7.6487 7.8582 7.0093 8.5929 6.7666 2.8544 4.3201 11.3486 7.2658 5.7441 6.0152 6.4166 6.3261 7.0216 3.7014 1.8309 7.8379 1.3369 3.3741 2.2643 4.4555 2.2424 1.2495 7.5480 1.5624 5.2074 1.4448 5.0952 1.3343 2.3889 4.8874 2.5823 2.8580 3.0349 1.0534 1.3122 3.6741 1.7029 1.6264 3.2090 6.7102 4.4754 3.5006 2.2577 3.3008 2.5266 4.0667 8.0766 6.4356 6.0876 6.7844 1.0850 1.0881 1.0931 1.0962 1.1007 1.1005 1.0786
irintensity: 0.0782 1.8480 0.8014 0.1912 3.8135 2.0779 0.6288 1.5345 3.2441 3.2067 0.0503 7.0480 1.9093 11.6968 2.8341 5.7258 6.8388 0.4870 8.9566 3.9722 45.1286 12.7803 176.8372 3.2190 18.5431 6.0542 21.7370 2.1819 13.2365 6.6769 8.8599 2.5206 0.1279 0.2977 15.4581 41.4368 17.0914 37.2718 16.3877 0.0385 48.4026 99.1247 26.3765 3.0489 1.4534 40.8513 3.0508 3.6912 27.8145 49.5959 3.0264 5.0013 6.5901 1.6341 0.1489 403.2992 2.6886 3.1313 26.0194 19.2849 15.0076 3.8671 62.4910
temp: 298.150 k
press: 1.00000 atm
elementType: 8 8 7 7 7 6 6 6 6 6 6 6 6 6 6 6 1 1 1 1 1 1 1
symmnumber: 1
zpe: 426269.3 jmol-1
zpe.correction: 0.162357 hartree
zpe.thermalcorrener: 0.174070 hartree
zpe.thermalcorrenthalpy: 0.175014 hartree
zpe.thermalcorrgfe: 0.123733 hartree
zpe.sumelectzpe: -736.912284 hartree
zpe.sumelectthermal: -736.900572 hartree
zpe.sumelectthermalent: -736.899627 hartree
zpe.sumelectthermalfe: -736.950909 hartree
dipole: -6.4050 0.3316 -0.1968
dipole: 6.4166
quadrupole: -107.5945 -84.2175 -92.2780
quadrupole: -4.7773 0.7151 3.5353
quadrupole: -12.8978 10.4791 2.4186 -4.7773 0.7151 3.5353
hfenergy: -737.0746415 hartree
pointgroup: C01 [X(C11H7N3O2)]
dipole: 2.5170622 -0.1663943 -0.0984086 debye
dipolederiv: -0.1579164 -0.2039239 0.0772591 -0.0721842 -0.4957876 0.1397583 0.0308507 0.1406263 -0.1884082 -1.5020025 0.2765862 -0.0482359 0.296192 -0.4884188 0.0399186 -0.0401784 0.0493815 -0.3514892 0.3694093 -0.5813906 0.2343244 0.0500089 -0.1535961 -0.0012513 0.0423247 0.0030106 -0.1280338 -1.2672301 0.4781561 -0.1607939 -0.6637722 -0.0991347 -0.0645614 0.3174848 -0.0951195 -0.2760656 -0.1150801 -0.056426 0.02625 -0.0971582 0.0592612 -0.0625439 0.052154 -0.0718854 -0.0958215 -0.2696665 0.0953616 -0.025945 0.1092348 -0.1685158 0.0847218 -0.0313019 0.0743025 0.016279 0.73117 0.0841332 -0.0576999 0.0882545 0.1428949 -0.0018373 -0.0324738 -0.01847 0.0490117 0.0174147 -0.0154534 0.0179928 -0.1111652 -0.0281687 0.0052463 -0.0365509 0.019688 -0.0125308 0.0733092 -0.0084574 0.0047344 0.208869 -0.1917981 0.0914053 -0.0913231 0.1130336 0.0311417 1.9770469 -0.3322845 0.0236079 0.2104858 0.6077914 -0.1405492 -0.2430379 -0.1164964 0.3308758 0.099448 0.2366781 -0.0973875 0.0142185 0.3464428 -0.1206775 -0.0343838 -0.1245742 0.0208372 -0.0974995 -0.0563221 0.0666981 0.0411554 -0.0676999 -0.091593 0.0072425 -0.0549288 -0.0257088 -0.0304416 0.0118141 -0.0702306 -0.0688409 -0.1197471 -0.0546676 -0.0254512 -0.0636531 -0.0281968 -0.0098247 0.0631567 -0.1115886 0.0734133 -0.0792706 -0.1023177 -0.1375227 -0.0943694 0.0120995 -0.1093064 -0.0522614 0.0653678 -0.0960756 -0.0565203 -0.1158917 0.1493222 -0.1234056 0.0122449 0.0601352 -0.0259317 -0.0004442 -0.0038689 -0.1111229 -0.0492848 -0.0320257 -0.05159 -0.0785892 0.0764202 0.0260055 -0.0132308 0.031827 0.1446744 0.0125882 -0.0095177 0.0320881 0.1906901 0.0899411 0.0484223 -0.062489 0.0168536 0.0983641 0.0832629 -0.0546496 0.0609425 0.0527979 0.0440662 -0.045417 0.0980948 -0.0264275 0.0834027 0.0811598 0.1200823 0.0682922 0.0162739 0.1153694 0.0231161 0.0030796 -0.049531 0.2692136 0.0304573 0.0215255 0.020174 0.3181399 -0.0030048 -0.0393701 0.0786521 -0.0559808 0.0981624 0.0908581 0.0984581 0.0907618 0.013031 0.0340561 0.0435114 -0.0485809 0.0699023 0.0755211 0.1113292 -0.0724121 0.111899 0.0046534 -0.1258139 0.030297 0.0005651 0.0345893 0.134052 0.0344695 0.0013836 0.0302922 0.1167678 unknown
polarizability: 233.2801041|-17.9077816|124.5123069|-1.3633355|-40.5197356|92.4041753 unknown
InChI: InChI=1S/C11H7N3O2/c15-11-10-8(6-16-14-10)9(12-13-11)7-4-2-1-3-5-7/h1-6,13H
charge 0 multiplicity 1
23 atoms
O  -2.103455 -2.342372 1.05454
O  -3.999551 1.394537 -0.36381
N  -0.35764 1.566539 -0.684004
N  -1.725838 1.793218 -0.727208
N  -3.08543 -1.307057 0.701672
C  -0.884917 -0.572122 0.316551
C  0.078832 0.40964 -0.162269
C  1.550471 0.210015 -0.121956
C  -2.307711 -0.2869 0.264899
C  -2.808847 0.995774 -0.271659
C  -0.820448 -1.870799 0.813426
C  2.373592 0.829893 -1.101284
C  2.163894 -0.571623 0.894369
C  3.771976 0.659077 -1.072662
C  3.565028 -0.740473 0.921058
C  4.374402 -0.131641 -0.064746
H  -0.015847 -2.572092 1.015914
H  1.900137 1.440114 -1.876383
H  1.558634 -1.008066 1.696106
H  -1.976385 2.700605 -1.130219
H  4.393026 1.137215 -1.837843
H  4.024644 -1.336944 1.716647
H  5.461232 -0.26684 -0.045636
