program: Gaussian 09
title: 000033036
version: EM64L-G09RevD.01
frameworkgroup: C1[X(C16H19ClN2)]
method: RPBEPBE
basis: SDD
operation: Freq
keyword: #p
keyword: freq=noraman
keyword: PBEPBE/SDD
title: #p freq=noraman PBEPBE/SDD
converged: YES YES NO NO
title: Mulliken charges:
elementType: Cl N N C C C C C C C C C C C C C C C C H H H H H H H H H H H H H H H H H H H
charge: -0.071510 -0.095340 -0.068294 -0.309231 -0.483964 -0.374164 0.509129 0.216440 -0.460270 -0.359192 -0.344734 -0.625329 -0.606838 -0.208503 -0.232330 -0.184222 -0.110085 -0.378973 -0.185716 0.236449 0.247624 0.225370 0.190709 0.229538 0.237025 0.279081 0.239852 0.233434 0.191398 0.219931 0.227510 0.218214 0.188751 0.251275 0.250614 0.237112 0.238125 0.231114
chargesum: 0.00000
title: Mulliken charges with hydrogens summed into heavy atoms:
elementType: Cl N N C C C C C C C C C C C C C C C C
charge: -0.071510 -0.095340 -0.068294 -0.072781 -0.010969 0.046082 0.509129 0.216440 -0.223245 -0.080111 -0.104882 0.019434 0.027637 0.042772 0.018284 0.052889 -0.110085 -0.140848 0.045398
polarizability: 2.35323225e+02 -1.85303978e+01 1.83320041e+02 -8.18638207e+00 -1.85729666e+01 1.57502716e+02
1716.lowfreq: -6.1718 0.0011 0.0013 0.0020 4.2860 9.8303 28.3536 30.7342 37.4216
frequency: 28.2720 30.0545 37.2307 49.5861 53.2036 65.0753 98.8226 134.5892 150.5647 201.5176 218.8819 225.0018 235.2547 264.3505 305.6938 319.8875 333.7698 355.4863 385.3632 404.9476 411.1349 416.1978 437.7663 495.1385 525.8395 541.6808 609.1938 619.5479 640.0865 670.9674 722.8726 738.3302 749.9500 771.9454 794.7607 823.9782 838.5519 849.6231 890.2289 901.9561 942.3497 953.0521 958.7008 965.8212 980.4057 999.6676 1000.0947 1032.5724 1033.9169 1038.5607 1052.6969 1070.8015 1079.4147 1087.1305 1097.0886 1106.4411 1135.0343 1151.9912 1165.1996 1183.7200 1193.3193 1212.0756 1219.6825 1245.2102 1264.1800 1278.9367 1294.4003 1301.1353 1305.3531 1345.1585 1352.2983 1365.4901 1379.6908 1399.0802 1415.1721 1421.4455 1440.0166 1451.2231 1455.9813 1463.1083 1470.1528 1473.4099 1476.7184 1479.7976 1487.7010 1563.9843 1580.2753 1585.0383 1596.0120 2837.9945 2848.3849 2864.3797 2998.2374 3015.8361 3018.3345 3022.8685 3025.9176 3062.5350 3077.3882 3082.1700 3123.6336 3125.3593 3136.4146 3142.2158 3153.8746 3164.9509 3168.1972 3169.8830
redmass: 5.1382 4.3035 4.1155 3.8203 3.1082 4.5075 3.9619 5.0809 4.6648 3.0346 2.1303 5.0125 1.1770 1.8057 2.4055 5.0369 3.4677 2.3928 2.9624 3.6206 2.9075 2.1570 4.5421 3.0283 3.6332 2.7989 5.8204 6.1871 4.9577 4.3783 3.6975 2.9921 1.5798 3.5172 2.8024 1.4998 1.3901 2.8374 1.7871 1.5566 2.1482 1.4590 1.5124 5.6490 1.3569 1.3498 4.3828 1.5696 2.1627 2.2362 2.2412 2.6657 1.7529 1.4771 1.8006 1.4814 1.4287 1.5085 1.0761 1.1242 2.3042 1.8857 1.6046 2.1430 2.4494 1.5603 1.5080 1.7277 2.3413 1.4102 1.7482 1.3602 4.1987 2.2879 1.2094 1.8038 1.1711 1.4816 1.3591 1.0532 1.1393 2.1769 1.0754 1.0524 1.0543 5.7827 5.7125 7.3236 6.1828 1.0700 1.0570 1.0578 1.0629 1.0842 1.0726 1.0828 1.0747 1.1006 1.1010 1.1005 1.0883 1.0896 1.0887 1.0893 1.0945 1.0952 1.0963 1.1016
irintensity: 1.8020 0.8824 0.3192 0.8078 0.5507 0.4462 0.4562 0.3432 0.1048 1.0987 1.3097 1.7387 0.2466 0.9550 3.9888 2.0250 1.6591 8.4170 1.6602 9.0237 0.2108 0.9084 7.4287 10.2349 8.9229 37.5208 2.5939 1.1020 2.0357 4.6429 6.0615 15.4366 34.0805 37.3410 10.5998 40.3450 19.6107 5.7697 1.7955 0.8457 5.9670 1.5885 0.6118 3.7768 1.1262 0.4050 42.2120 21.3544 11.3441 26.2889 6.8862 29.4844 8.0006 4.6603 2.8615 10.5924 11.6954 9.4401 1.9827 2.0172 1.7394 7.7295 28.7917 0.1571 8.5830 7.6232 0.3810 6.6401 2.1353 5.7261 1.8180 9.9539 0.9098 14.0272 9.7835 11.9260 5.3648 21.3579 14.7200 15.6183 15.2391 114.2551 11.3457 11.2113 14.2398 10.9648 46.3758 2.0558 4.3652 53.9297 67.9415 295.5072 21.3717 7.2515 34.4287 39.9576 31.6761 22.1190 30.6686 49.5660 16.0192 11.6206 6.3689 0.2708 25.4588 7.0845 3.7609 22.5681
temp: 298.150 k
press: 1.00000 atm
elementType: 17 7 7 6 6 6 6 6 6 6 6 6 6 6 6 6 6 6 6 1 1 1 1 1 1 1 1 1 1 1 1 1 1 1 1 1 1 1
symmnumber: 1
zpe: 819062.7 jmol-1
zpe.correction: 0.311964 hartree
zpe.thermalcorrener: 0.330403 hartree
zpe.thermalcorrenthalpy: 0.331348 hartree
zpe.thermalcorrgfe: 0.262893 hartree
zpe.sumelectzpe: -1189.246071 hartree
zpe.sumelectthermal: -1189.227632 hartree
zpe.sumelectthermalent: -1189.226688 hartree
zpe.sumelectthermalfe: -1189.295143 hartree
dipole: -4.3198 0.2691 1.0808
dipole: 4.4611
quadrupole: -129.4682 -108.2947 -115.3361
quadrupole: -2.1560 -2.5398 -2.1736
quadrupole: -11.7685 9.4050 2.3635 -2.1560 -2.5398 -2.1736
hfenergy: -1189.5580357 hartree
pointgroup: C01 [X(C16H19Cl1N2)]
dipole: -1.7117047 -0.1663093 -0.3505599 debye
polarizability: 235.7072886|18.7125714|176.6517445|2.8424426|-22.3007784|163.7869497 unknown
InChI: InChI=1S/C16H19ClN2/c1-19(2)12-10-15(16-5-3-4-11-18-16)13-6-8-14(17)9-7-13/h3-9,11,15H,10,12H2,1-2H3
charge 0 multiplicity 1
38 atoms
Cl 5.843098 0.404035 -0.282005
N  -2.826155 2.124346 -0.353379
N  -0.872909 -1.572654 1.304723
C  -0.340157 0.399795 -0.102889
C  -0.836451 1.359933 1.017589
C  -2.357811 1.612714 0.960222
C  1.192774 0.367786 -0.151103
C  -0.934108 -1.001048 0.059196
C  1.883667 0.940519 -1.248364
C  1.952317 -0.196901 0.907593
C  -1.515842 -1.679633 -1.041787
C  -2.32997 3.483456 -0.653804
C  -4.295772 2.040933 -0.484187
C  3.297063 0.95868 -1.299642
C  3.36371 -0.191118 0.873873
C  -2.035604 -2.980071 -0.861762
C  4.014504 0.389845 -0.231901
C  -1.377156 -2.82933 1.467217
C  -1.965692 -3.573232 0.419788
H  -0.715246 0.802812 -1.061932
H  -0.596551 0.917058 2.001729
H  -0.278479 2.312556 0.943323
H  -2.635494 2.312085 1.79206
H  -2.885772 0.659662 1.153261
H  1.315659 1.380943 -2.076835
H  1.428703 -0.657156 1.752516
H  -1.558915 -1.186368 -2.018182
H  -1.226553 3.497091 -0.665212
H  -2.675113 4.249307 0.087592
H  -2.682029 3.792682 -1.654334
H  -4.622881 0.996848 -0.333258
H  -4.59904 2.352499 -1.500236
H  -4.843829 2.685111 0.250252
H  3.823875 1.402654 -2.14944
H  3.945475 -0.629987 1.689978
H  -2.487593 -3.518644 -1.701765
H  -1.303835 -3.246807 2.478596
H  -2.355486 -4.578902 0.606109
