program: Gaussian 09
title: 000033006
version: EM64L-G09RevD.01
frameworkgroup: C1[X(C10H19NO2)]
method: RPBEPBE
basis: SDD
operation: Freq
keyword: #p
keyword: freq=noraman
keyword: PBEPBE/SDD
title: #p freq=noraman PBEPBE/SDD
converged: YES YES NO NO
title: Mulliken charges:
elementType: O O N C C C C C C C C C C H H H H H H H H H H H H H H H H H H H
charge: -0.249948 -0.240808 -0.166429 -0.353438 -0.370107 -0.360064 -0.399045 -0.356491 -0.694958 0.251047 0.221927 -0.732635 -0.785343 0.183766 0.201087 0.189939 0.240385 0.189163 0.198389 0.222337 0.264321 0.194233 0.199067 0.212351 0.209534 0.216926 0.259066 0.239819 0.256393 0.243834 0.269195 0.246487
chargesum: 0.00000
title: Mulliken charges with hydrogens summed into heavy atoms:
elementType: O O N C C C C C C C C C C
charge: -0.249948 -0.240808 -0.166429 0.031415 0.060217 0.027487 0.087613 0.036809 -0.056147 0.251047 0.221927 0.022643 -0.025827
polarizability: 1.47797721e+02 -2.72963157e+00 1.24483368e+02 9.06283642e+00 -1.18440388e+00 9.49650506e+01
1716.lowfreq: -12.6599 -7.2272 0.0004 0.0005 0.0008 12.5741 28.3551 44.8325 46.3662
frequency: 28.0980 44.4546 46.2055 56.8365 86.1866 91.0488 125.4932 144.3081 155.1909 197.3502 214.8323 221.9881 235.8851 281.6772 302.8090 370.5642 403.3001 419.5837 426.4604 446.6649 549.0415 555.1839 601.0429 627.8499 706.9637 726.5712 741.5780 783.2103 864.7580 889.5338 919.2110 966.3584 981.8762 1009.4298 1017.1446 1028.3983 1034.9767 1039.0815 1065.1133 1080.5338 1118.3752 1120.2197 1152.0433 1197.4346 1235.3530 1239.6010 1250.6129 1279.0903 1288.9186 1292.7092 1298.0544 1334.9459 1346.0789 1357.3352 1377.0489 1380.7108 1389.2669 1391.3424 1426.0292 1443.5677 1444.8782 1464.3882 1465.1250 1469.3007 1476.2582 1476.8339 1478.5206 1484.5175 1489.5411 1604.1481 1613.2899 2952.0064 2957.3152 2968.0827 2973.0083 2978.3135 2992.2250 2994.8267 3007.7066 3010.6316 3030.9874 3040.8278 3050.2949 3069.3320 3072.5948 3084.9546 3100.7582 3101.2539 3131.0070 3132.1459
redmass: 4.2654 3.0747 2.5806 2.4892 3.8924 3.1271 1.7300 3.2772 2.5633 1.0911 1.0410 3.4140 1.1113 3.9181 4.3867 3.0884 4.5837 2.6118 2.8575 3.7955 3.9675 2.8131 3.6604 3.5264 4.2152 1.0665 1.1009 1.2137 1.4778 1.8909 2.1062 2.1464 1.3080 2.8091 1.7237 2.8369 1.7414 1.7879 2.8404 2.2335 4.2755 2.6299 1.8792 1.6569 1.4362 2.0133 2.2012 1.3913 1.0857 1.2446 1.1847 1.4873 1.5121 1.6455 1.3562 1.2149 1.2338 1.2170 1.1007 1.0723 1.0486 1.0742 1.0689 1.0748 1.0795 1.0586 1.0425 1.0813 1.0930 6.2973 9.1625 1.0595 1.0594 1.0597 1.0364 1.0654 1.0945 1.0383 1.0995 1.0356 1.1024 1.0602 1.1003 1.1007 1.0993 1.0969 1.0963 1.1040 1.1032 1.0995
irintensity: 0.3803 6.8438 0.9903 1.6663 1.9114 0.1139 0.0697 0.7353 0.1556 0.5320 0.6279 2.2406 0.0012 7.9065 3.0215 0.9824 0.7057 2.0477 0.2817 4.4843 20.0616 0.3029 13.1694 5.0397 3.1471 11.6141 3.6184 11.2836 3.0219 4.3440 0.5851 33.6926 24.3846 10.8552 10.3498 2.4371 5.0567 14.4011 0.8535 0.1643 18.4920 13.2611 61.9810 49.1029 48.4278 156.5761 35.2904 46.6633 14.9571 0.1166 16.0278 79.9673 53.4549 2.3093 40.9350 39.8938 51.7009 10.9097 37.6588 43.7594 17.8496 0.5548 1.0759 6.5177 1.7648 4.7595 12.7193 6.7994 29.6334 56.4012 323.2310 6.8176 9.7147 76.1251 34.6372 36.3251 7.8432 4.5027 2.0949 4.0619 34.8764 28.5441 42.5169 89.2495 52.9039 10.8083 4.4587 17.8784 16.2788 10.1296
temp: 298.150 k
press: 1.00000 atm
elementType: 8 8 7 6 6 6 6 6 6 6 6 6 6 1 1 1 1 1 1 1 1 1 1 1 1 1 1 1 1 1 1 1
symmnumber: 1
zpe: 726854.6 jmol-1
zpe.correction: 0.276844 hartree
zpe.thermalcorrener: 0.292887 hartree
zpe.thermalcorrenthalpy: 0.293831 hartree
zpe.thermalcorrgfe: 0.231741 hartree
zpe.sumelectzpe: -596.628308 hartree
zpe.sumelectthermal: -596.612265 hartree
zpe.sumelectthermalent: -596.611321 hartree
zpe.sumelectthermalfe: -596.673411 hartree
dipole: 2.2242 2.3910 0.8700
dipole: 3.3795
quadrupole: -88.0473 -84.8575 -80.4253
quadrupole: 1.9227 -2.5829 4.3864
quadrupole: -3.6039 -0.4141 4.0181 1.9227 -2.5829 4.3864
hfenergy: -596.9051523 hartree
pointgroup: C01 [X(C10H19N1O2)]
dipole: -0.8882157 0.9141127 -0.3785173 debye
polarizability: 147.7367183|3.4088735|124.6194822|8.8627072|0.1088615|94.8899393 unknown
InChI: InChI=1S/C10H19NO2/c1-4-5-6-7-8-11(9(2)12)10(3)13/h4-8H2,1-3H3
charge 0 multiplicity 1
32 atoms
O  1.553078 -2.255669 -0.300114
O  3.478015 1.323587 0.680216
N  1.719291 0.062925 -0.262416
C  -2.16715 0.018629 -0.584428
C  -0.78712 0.0005 0.109831
C  -3.343206 -0.0542 0.415402
C  0.370659 0.068878 -0.909773
C  -4.728075 -0.031718 -0.270749
C  -5.89781 -0.101624 0.734464
C  2.249414 -1.250053 0.01586
C  2.362448 1.284027 0.089942
C  3.610691 -1.402374 0.661366
C  1.648255 2.579534 -0.293553
H  -2.265741 0.94027 -1.19682
H  -2.233761 -0.835189 -1.289974
H  -0.719805 0.848736 0.821355
H  -0.680154 -0.927903 0.701331
H  -3.275082 0.794492 1.127974
H  -3.250609 -0.978256 1.022763
H  0.282013 0.966565 -1.542758
H  0.324136 -0.818195 -1.563159
H  -4.818122 0.890572 -0.880645
H  -4.7966 -0.881451 -0.980163
H  -5.850368 -1.030127 1.334163
H  -5.868181 0.752415 1.437379
H  -6.876049 -0.081749 0.220039
H  3.638295 -0.936053 1.660212
H  3.816918 -2.48127 0.73532
H  4.398092 -0.8966 0.078411
H  1.64551 2.725093 -1.389682
H  2.208503 3.40683 0.165967
H  0.602514 2.609276 0.05674
