program: Gaussian 09
title: 000033001
version: EM64L-G09RevD.01
frameworkgroup: C1[X(C8H14O)]
method: RPBEPBE
basis: SDD
operation: Freq
keyword: #pfreq=noraman
keyword: PBEPBE/SDD
title: #p freq=noraman PBEPBE/SDD
converged: YES YES NO NO
title: Mulliken charges:
elementType: O C C C C C C C C H H H H H H H H H H H H H H
charge: -0.195642 -0.430352 -0.347620 -0.450732 -0.187138 -0.193898 -0.434904 -0.686445 -0.058238 0.192384 0.200196 0.212354 0.197318 0.223436 0.224073 0.225952 0.223626 0.245434 0.231560 0.210555 0.218512 0.208212 0.171356
chargesum: 0.00000
title: Mulliken charges with hydrogens summed into heavy atoms:
elementType: O C C C C C C C C
charge: -0.195642 -0.037772 0.062052 -0.003223 0.038814 0.029728 0.042090 -0.049165 0.113117
polarizability: 1.27008274e+02 5.16535130e-01 7.78491261e+01 -6.27540387e+00 1.88508002e+00 6.93489986e+01
1716.lowfreq: -0.0001 0.0009 0.0012 4.2319 9.6509 31.3243 41.1477 53.1835 67.9085
frequency: 39.2258 52.6702 67.7806 86.4569 102.5699 166.1824 177.1437 220.7214 269.8564 280.2326 306.9163 450.3065 505.8254 661.7142 680.0934 737.9670 772.1615 847.8656 870.9053 886.4954 903.5192 977.1414 980.7099 1032.3544 1052.5259 1067.5397 1095.1494 1100.2940 1131.1536 1177.1065 1222.6405 1253.2734 1259.2379 1271.9561 1281.6645 1299.7892 1316.0156 1340.8905 1355.0800 1375.1424 1387.2445 1424.0440 1459.7534 1462.4954 1473.2750 1476.0904 1485.4027 1643.6288 1687.2300 2852.3273 2951.6905 2955.3124 2972.4112 2978.0382 2985.0119 2996.9260 3009.4964 3035.2948 3047.7159 3061.4086 3069.4185 3073.0994 3073.5865
redmass: 3.7153 2.9323 3.3947 2.1796 2.6140 1.7918 4.5064 1.1510 2.2189 2.1704 2.9323 4.1866 2.8294 1.2005 3.7131 1.1377 1.4846 1.3837 1.4904 1.9392 2.2547 1.1134 1.8503 1.7383 2.2384 2.7952 2.0943 2.6201 1.7012 1.6428 1.3623 1.3220 1.2221 1.2355 1.1373 1.2232 1.3379 1.5165 1.5842 1.2199 1.2131 1.0908 1.0864 1.0893 1.0576 1.0428 1.0800 7.5952 6.5978 1.0841 1.0616 1.0626 1.0356 1.0614 1.0660 1.0916 1.0957 1.1015 1.0952 1.0959 1.0976 1.0955 1.0963
irintensity: 0.6804 4.3706 1.7775 0.0613 1.0305 2.1753 8.7981 0.0602 0.3760 1.1961 5.9970 1.2816 2.5095 9.5161 5.3272 7.1625 1.2205 4.0967 0.5354 4.2772 11.7526 52.6342 5.0758 11.0281 2.2798 4.7202 3.8526 5.2940 1.1839 0.9952 1.2440 10.2159 6.7076 2.2567 0.6795 0.0393 13.0628 7.9910 3.2913 5.6976 10.8398 35.1517 5.5802 14.6766 2.9085 12.5717 15.9510 133.7340 0.0146 168.7525 25.6302 37.3507 49.3261 32.4680 15.7039 11.5598 5.8076 15.8647 5.2753 3.9345 18.0630 106.8855 87.7952
temp: 298.150 k
press: 1.00000 atm
elementType: 8 6 6 6 6 6 6 6 6 1 1 1 1 1 1 1 1 1 1 1 1 1 1
symmnumber: 1
zpe: 521794.2 jmol-1
zpe.correction: 0.198741 hartree
zpe.thermalcorrener: 0.210186 hartree
zpe.thermalcorrenthalpy: 0.211130 hartree
zpe.thermalcorrgfe: 0.160141 hartree
zpe.sumelectzpe: -387.712290 hartree
zpe.sumelectthermal: -387.700845 hartree
zpe.sumelectthermalent: -387.699901 hartree
zpe.sumelectthermalfe: -387.750890 hartree
dipole: 1.6513 2.5659 -0.2206
dipole: 3.0593
quadrupole: -64.7576 -57.6969 -54.5286
quadrupole: -11.2860 0.1902 1.3170
quadrupole: -5.7633 1.2975 4.4658 -11.2860 0.1902 1.3170
hfenergy: -387.9110309 hartree
pointgroup: C01 [X(C8H14O1)]
dipole: 0.6538342 -1.0061611 0.0938809 debye
dipolederiv: -0.6618964 0.1222886 0.0001981 0.2929421 -0.7348471 0.0484918 0.0067255 0.0498837 -0.2981084 -0.1227525 -0.0013515 0.0166757 -0.0624691 0.0961109 -0.0400518 -0.0323459 -0.0183315 0.1678245 0.0557493 0.0117694 0.0041548 0.1469583 0.1018309 0.0289402 0.0219789 0.013559 0.1700956 -0.0492411 0.0263993 0.0091697 -0.0011571 0.0728557 -0.0400173 -0.0677903 -0.0188364 0.1314984 0.1081214 -0.0757293 0.059389 -0.2008873 -0.0999121 0.170727 0.0057142 0.1755371 -0.0190721 0.1035875 -0.090308 0.0507482 -0.2059443 -0.1090304 0.1660537 0.0048843 0.1817698 -0.0144317 -0.4766881 0.1692312 0.0165222 0.3857142 -0.0870757 0.0369141 0.0386389 0.0179762 0.1687969 -0.0977055 0.0196081 0.013547 -0.0517781 0.0565124 -0.0049086 0.0229945 -0.0003907 0.0979266 1.0895207 -0.1665413 -0.0527045 -0.250648 0.9080918 -0.1142502 -0.0785837 -0.1016094 0.0810562 -0.039719 0.0436906 -0.0735098 0.0734775 0.0031324 0.1024525 -0.0486063 0.1263742 -0.0825674 0.0309183 -0.0182209 -0.0083743 0.0062325 -0.0446278 -0.0999791 0.0362908 -0.1447117 -0.0658452 0.0227955 0.0400264 -0.0560172 0.0136134 -0.0089578 0.0984794 -0.0346561 0.1279469 -0.0908322 0.0380748 0.0232147 0.0387881 0.0085044 -0.0584923 -0.1150864 0.0201189 -0.1530008 -0.0712943 -0.0016437 0.0309596 -0.0597438 0.0331797 0.031739 0.0889514 -0.029118 0.0938997 -0.049025 0.046293 -0.0221395 -0.0155089 -0.0080846 -0.0123284 -0.0886624 0.0315863 -0.1162718 -0.0463557 0.0296991 0.0465642 0.017286 0.0806397 0.025605 -0.1422647 0.0234152 -0.1353817 -0.0150197 0.0278764 0.0442461 0.0164843 0.0754637 0.0268217 -0.1447365 0.018198 -0.1379811 -0.0212874 0.0658361 0.0191008 -0.0087754 -0.0648169 0.0528311 0.0863274 0.0083212 0.1140483 -0.0437055 0.0708626 0.0047789 0.0022797 -0.0614071 0.0018356 -0.0935093 -0.0012366 -0.1338617 -0.0025477 0.0702673 0.0023 -0.0121112 0.060555 -0.0299259 -0.1357744 0.0353731 -0.1380304 -0.0655274 -0.1273348 -0.1187667 0.0279522 -0.1516204 -0.0470578 0.0321975 0.0384683 0.0283451 0.0941724 0.0547892 0.0311662 -0.0242208 0.0758596 0.0206627 0.1084021 -0.0821752 0.1184388 -0.1072978 -0.2374101 -0.142287 0.0377707 -0.1943271 -0.1657741 0.0513038 0.0618042 0.0506283 0.0815467 unknown
polarizability: 126.9068283|-0.2817583|77.8521122|6.7329681|1.8980801|69.4474586 unknown
InChI: InChI=1S/C8H14O/c1-2-3-4-5-6-7-8-9/h4-5,8H,2-3,6-7H2,1H3
charge 0 multiplicity 1
23 atoms
O  -4.253506 0.894772 -0.063757
C  2.446263 -0.509803 0.22617
C  3.505997 0.603528 -0.000154
C  -1.412162 0.31216 -0.234874
C  1.04474 0.036761 0.397528
C  -0.016698 -0.251847 -0.400609
C  -2.465225 -0.796397 -0.006907
C  4.940008 0.042097 -0.107076
C  -3.898123 -0.301251 0.066834
H  2.737437 -1.083444 1.132344
H  2.473386 -1.22176 -0.622468
H  3.248138 1.163411 -0.920169
H  3.451673 1.331606 0.834299
H  -1.706657 0.889268 -1.134257
H  -1.442312 1.025371 0.609031
H  0.899337 0.737535 1.236587
H  0.129246 -0.947525 -1.244008
H  -2.25155 -1.360068 0.926509
H  -2.420947 -1.561188 -0.813466
H  5.024984 -0.673279 -0.946762
H  5.677246 0.848386 -0.275037
H  5.227428 -0.491929 0.818502
H  -4.660904 -1.103204 0.253642
