program: Gaussian 09
title: 000033072
version: EM64L-G09RevD.01
frameworkgroup: C1[X(C19H20N2OS)]
method: RPBEPBE
basis: SDD
operation: Freq
keyword: #p
keyword: freq=noraman
keyword: PBEPBE/SDD
title: #p freq=noraman PBEPBE/SDD
converged: YES YES NO NO
title: Mulliken charges:
elementType: S O N N C C C C C C C C C C C C C C C C C C C H H H H H H H H H H H H H H H H H H H H
charge: 0.235913 -0.258306 -0.090731 0.014775 -0.403428 -0.387450 -0.379714 -0.374872 -0.361614 -0.368783 0.074050 0.274789 -0.333383 -0.345816 -0.203662 -0.174092 -0.268785 -0.194730 -0.213770 -0.266624 -0.219638 -0.207463 -0.233493 0.199116 0.226137 0.212941 0.209297 0.206775 0.210983 0.229421 0.226397 0.209992 0.241369 0.223237 0.288734 0.280823 0.256580 0.244438 0.268174 0.257154 0.232194 0.231571 0.231492
chargesum: 0.00000
title: Mulliken charges with hydrogens summed into heavy atoms:
elementType: S O N N C C C C C C C C C C C C C C C C C C C
charge: 0.235913 -0.258306 -0.090731 0.014775 0.021825 0.034787 0.038044 0.080947 0.089747 -0.145546 0.074050 0.274789 -0.044650 -0.064993 -0.203662 0.082489 -0.024347 -0.194730 0.054404 -0.009470 0.012556 0.024108 -0.002000
polarizability: 3.57067182e+02 9.69835472e+00 3.00724432e+02 1.60987983e+01 6.84219470e+00 1.52278028e+02
1716.lowfreq: -6.4109 -3.5548 -0.0018 -0.0008 0.0015 5.1442 12.9471 19.3107 23.5573
frequency: 11.6865 18.9846 23.3717 31.9882 44.9977 50.8588 67.7824 91.3177 139.3205 155.1962 180.1330 198.0958 209.5692 242.3271 252.6535 260.8231 283.5836 325.7970 344.0142 353.0251 381.3677 401.7780 406.4865 416.2425 441.2585 454.3126 474.6990 491.0005 514.3772 534.0613 602.8379 610.3354 627.5828 662.7279 673.9881 678.3938 695.4043 746.4628 747.9868 754.3730 774.0203 800.7212 847.6723 849.0878 852.4071 854.4628 859.4412 895.3747 919.7496 922.1420 949.1420 976.9120 985.0089 991.3976 994.9579 996.1887 1001.3186 1002.9060 1015.4005 1045.7584 1060.0641 1072.6788 1074.9021 1083.6209 1089.9520 1105.6921 1113.3414 1123.4635 1152.9845 1171.5052 1171.9619 1183.1938 1192.4320 1242.9665 1258.7515 1268.1417 1295.3301 1296.6844 1302.6566 1304.0536 1331.7639 1341.9492 1348.1516 1351.8970 1356.4852 1362.6570 1374.1525 1377.9123 1406.0092 1426.3122 1457.9873 1459.2921 1462.3437 1466.2129 1468.3148 1473.5792 1476.6901 1498.3797 1535.2533 1567.5946 1586.4104 1587.2440 1598.2416 2924.9873 2930.7349 2974.5708 2991.6719 2992.9637 3044.9488 3050.3045 3054.6875 3060.2120 3064.8224 3082.6191 3128.4409 3136.1440 3137.7142 3146.1630 3150.7495 3158.8479 3160.8454 3169.7785 3179.5359
redmass: 6.4455 3.6863 3.8083 4.1343 3.6989 4.0781 5.3040 7.8576 5.0543 4.2878 5.4413 3.2557 2.7297 3.3260 4.4925 4.8381 5.4112 3.6971 5.9284 1.9229 4.5821 2.9544 2.9453 6.6363 3.0292 3.3744 3.4456 5.0737 4.7918 2.9082 3.6048 6.4175 6.9957 4.7655 4.6319 5.8809 2.2414 3.2892 4.0845 1.7034 3.7330 1.6010 1.2545 1.3768 2.7856 1.3109 1.4405 1.6509 2.3424 1.3692 1.3194 1.3911 6.2284 2.7367 1.3656 1.3176 1.3578 3.9255 3.3305 2.0497 3.4379 1.7690 2.4882 2.3659 1.4411 2.0459 1.3794 2.3163 1.3431 2.0255 1.0799 1.1161 1.1981 2.0825 1.2942 1.2714 1.6096 1.3160 1.3353 1.9649 1.2820 1.4122 1.4332 1.5986 3.8439 1.6115 7.8757 2.0670 4.2460 2.1142 1.0903 2.0761 1.0992 1.0838 1.0876 2.2925 1.1102 7.9936 5.3461 7.1559 6.3328 5.9922 6.1890 1.0705 1.0694 1.0644 1.0617 1.0605 1.0963 1.0940 1.0980 1.0978 1.0932 1.0920 1.0848 1.0885 1.0884 1.0896 1.0928 1.0967 1.0955 1.1016 1.0947
irintensity: 0.8625 0.5086 0.3654 0.2132 0.3748 0.7598 0.9937 1.3922 1.2978 3.1426 0.4210 1.0647 1.8786 12.3428 1.4249 1.4515 4.0442 8.1248 1.4029 5.6601 27.0033 0.9856 0.7035 0.1061 0.2723 4.3020 18.7670 21.9852 3.1382 6.8074 4.6705 0.3122 2.9689 22.9647 14.6490 6.3812 47.1705 17.1457 7.8514 44.4368 69.4805 17.6815 2.2632 43.5235 3.4560 16.9296 43.8398 23.1932 9.5785 2.4019 4.0110 0.0226 9.9757 71.4254 4.0566 0.4510 0.3697 30.9942 18.1945 6.2963 41.2647 9.2002 22.9372 62.9502 30.8875 48.6465 18.9923 5.4817 12.0559 112.5192 5.0276 2.5697 23.5218 1.1951 20.7580 14.9248 24.1710 2.2020 17.6366 415.3438 14.0245 2.6237 0.9213 21.6500 5.4157 20.6922 1.1994 47.7372 20.3029 10.3516 6.1544 38.4032 45.6387 18.3619 23.4602 8.0995 3.3968 194.7669 296.8413 69.5196 5.6183 45.1132 117.3694 36.4125 73.2700 40.3473 28.8001 30.6515 71.8739 10.7301 34.5308 63.3190 48.6028 18.7406 0.5881 4.4768 6.2783 3.8822 15.8503 20.4332 6.7726 18.5278 15.0326
temp: 298.150 k
press: 1.00000 atm
elementType: 16 8 7 7 6 6 6 6 6 6 6 6 6 6 6 6 6 6 6 6 6 6 6 1 1 1 1 1 1 1 1 1 1 1 1 1 1 1 1 1 1 1 1
symmnumber: 1
zpe: 906501.5 jmol-1
zpe.correction: 0.345268 hartree
zpe.thermalcorrener: 0.366352 hartree
zpe.thermalcorrenthalpy: 0.367296 hartree
zpe.thermalcorrgfe: 0.290796 hartree
zpe.sumelectzpe: -1317.114153 hartree
zpe.sumelectthermal: -1317.093070 hartree
zpe.sumelectthermalent: -1317.092126 hartree
zpe.sumelectthermalfe: -1317.168625 hartree
dipole: 3.4577 -7.0548 -0.4170
dipole: 7.8676
quadrupole: -114.3361 -146.8732 -140.5714
quadrupole: -7.1491 -0.7297 -0.5331
quadrupole: 19.5908 -12.9463 -6.6445 -7.1491 -0.7297 -0.5331
hfenergy: -1317.4594217 hartree
pointgroup: C01 [X(C19H20N2O1S1)]
dipole: -1.4035997 2.6971199 0.5802956 debye
polarizability: 357.3443226|8.3524224|288.8057882|12.4836382|41.810736|163.9195322 unknown
InChI: InChI=1S/C19H20N2OS/c22-19(15-20-21-13-5-2-6-14-21)16-9-11-18(12-10-16)23-17-7-3-1-4-8-17/h1,3-4,7-12,15H,2,5-6,13-14H2
charge 0 multiplicity 1
43 atoms
S  4.368529 -1.092784 -0.356633
O  -1.913931 -3.629644 -1.224312
N  -3.823946 0.605532 -0.530474
N  -2.724754 -0.18628 -0.652349
C  -5.994412 2.52966 -0.200614
C  -6.232403 1.016336 -0.003995
C  -4.545158 2.885575 0.200303
C  -5.215788 0.160492 -0.794024
C  -3.539768 2.056693 -0.621537
C  -2.812126 -1.491676 -0.887216
C  -1.646413 -2.39959 -0.971987
C  -0.21319 -1.978653 -0.790155
C  0.221298 -0.650947 -0.522358
C  0.772102 -3.000946 -0.899631
C  2.554109 -1.384991 -0.47752
C  1.591708 -0.354231 -0.374517
C  2.138932 -2.715751 -0.740885
C  4.481997 0.491598 0.581759
C  3.955231 0.602682 1.891018
C  5.189443 1.568709 -0.000171
C  4.126877 1.805598 2.611695
C  5.373363 2.763867 0.73504
C  4.839685 2.886441 2.038341
H  -6.164245 2.803096 -1.262484
H  -6.717884 3.109926 0.401155
H  -6.144225 0.770669 1.072032
H  -7.252235 0.731411 -0.324108
H  -4.342099 3.95995 0.033558
H  -4.397437 2.68162 1.27847
H  -5.316857 -0.895565 -0.49049
H  -5.424238 0.216515 -1.88631
H  -3.584632 2.374922 -1.687782
H  -2.504773 2.200199 -0.272068
H  -3.759817 -2.030521 -1.049541
H  -0.523342 0.143213 -0.440704
H  0.43063 -4.021087 -1.103844
H  1.907434 0.676005 -0.181461
H  2.880666 -3.518867 -0.812867
H  3.419589 -0.241572 2.337366
H  5.585305 1.47348 -1.016456
H  3.716324 1.892227 3.623812
H  5.925218 3.596225 0.284586
H  4.979036 3.814061 2.604459
