program: Gaussian 09
title: 000033142
version: EM64L-G09RevD.01
frameworkgroup: C1[X(C15H17N3)]
method: RPBEPBE
basis: SDD
operation: Freq
keyword: #pfreq=noraman
keyword: PBEPBE/SDD
title: #p freq=noraman PBEPBE/SDD
converged: YES YES NO NO
title: Mulliken charges:
elementType: N N N C C C C C C C C C C C C C C C H H H H H H H H H H H H H H H H H
charge: -0.405678 -0.123526 -0.690650 -0.488816 0.443052 0.400187 -0.537200 -0.381896 -0.444091 0.259324 -0.385935 -0.406444 -0.222776 -0.220074 -0.242955 -0.233165 -0.227484 -0.244878 0.258526 0.221331 0.206380 0.211577 0.285594 0.252482 0.234844 0.218264 0.281128 0.224353 0.225695 0.228011 0.219301 0.219360 0.222379 0.306113 0.337669
chargesum: 0.00000
title: Mulliken charges with hydrogens summed into heavy atoms:
elementType: N N N C C C C C C C C C C C C C C C
charge: -0.120084 -0.123526 -0.046868 -0.008959 0.443052 0.400187 -0.119244 -0.129415 -0.209248 0.259324 -0.167671 -0.125316 0.001577 0.005621 -0.014944 -0.013864 -0.008124 -0.022499
polarizability: 2.54728976e+02 5.64453490e+00 1.73233915e+02 2.13863092e+00 1.89383848e+01 1.16147068e+02
1716.lowfreq: -8.2462 -7.1090 -0.0006 -0.0003 -0.0002 3.7649 16.4578 17.1226 26.6967
frequency: 15.2740 16.6952 26.6403 41.1545 56.4381 87.0915 156.0276 164.8958 195.4068 222.5051 232.9245 250.2516 318.3881 360.4028 368.6762 392.0331 405.1087 405.3662 451.7684 463.0877 484.3664 529.3544 572.6856 594.4631 615.1821 617.8252 645.9889 667.9257 704.1212 705.6153 736.7802 750.7379 803.2457 817.7476 855.8962 856.8844 889.7695 906.2040 912.0891 970.3163 977.8294 979.5417 983.8872 989.6731 989.8864 995.7319 1007.6283 1018.3340 1024.1849 1025.5933 1072.0822 1080.2384 1119.8585 1132.3291 1165.7625 1170.9273 1174.8525 1182.4016 1202.7399 1209.5640 1217.5970 1218.9916 1288.9873 1298.7967 1324.8349 1337.4314 1359.7279 1387.0522 1388.7821 1435.6967 1441.0317 1445.8654 1478.5569 1480.8333 1488.8619 1489.7730 1593.0231 1594.2624 1613.8492 1615.3136 1616.1175 1655.3355 2859.2070 2895.2575 2952.1541 3028.5573 3100.1656 3115.9621 3119.7121 3123.1325 3133.8300 3136.2113 3146.7921 3153.7069 3162.6994 3169.5665 3540.5880 3552.0505 3698.5874
redmass: 3.8433 4.2788 4.2595 3.8783 4.0967 4.3400 3.6648 5.0041 3.0568 3.9577 3.1791 2.9196 3.1641 2.9740 1.3904 1.1727 2.7964 2.8523 2.5859 2.7345 1.6641 3.2341 3.5176 3.6467 6.2658 6.1655 4.1489 7.1965 2.3418 1.9457 1.3619 1.6176 4.3439 3.8244 1.2554 1.2474 3.9833 1.4154 1.3685 2.0374 1.4133 1.3930 1.6020 6.1940 5.9273 1.3426 1.4387 1.7968 2.0974 2.1723 1.5555 1.5846 3.4030 3.1562 1.0787 1.0560 1.1164 1.1076 2.0636 1.2487 1.7864 1.3460 1.5029 1.5022 1.4742 1.5264 1.9216 5.5076 5.3491 2.0218 2.1447 1.1529 1.5764 2.2973 1.6914 1.6992 5.7237 6.1267 1.4264 5.6693 4.0679 4.7450 1.0551 1.1000 1.0686 1.0912 1.0876 1.0867 1.0861 1.0863 1.0928 1.0914 1.0961 1.0982 1.1015 1.0957 1.0757 1.0461 1.1029
irintensity: 0.0791 0.3431 0.4607 0.2302 3.5622 3.3848 8.0159 3.4458 2.1788 5.4095 0.6220 3.2399 2.5905 22.0100 102.0138 207.8845 0.9565 0.0167 6.3332 4.4161 153.8509 18.6482 26.8845 33.9248 0.1871 1.4435 4.7122 12.3740 23.1253 44.7455 84.9140 63.6899 2.8368 5.2920 0.1311 0.1032 8.4891 1.1089 1.8231 3.6607 0.1150 0.1137 1.4438 0.3515 0.0900 0.5865 3.0284 5.5538 16.1897 11.3625 11.3137 11.7303 10.5791 9.1527 3.8668 0.1570 6.9682 2.8409 7.5640 30.5499 1.1354 18.1707 73.8810 11.9912 45.2618 46.3253 22.9077 19.3052 5.3049 33.8124 12.8096 41.7758 39.9000 23.3710 120.4498 155.1077 19.0755 2.1834 139.2341 33.9737 5.3396 570.3476 74.5532 46.3786 39.2120 10.9651 15.0172 8.3598 0.9302 0.1354 38.6592 17.5536 41.6722 37.4195 24.2720 11.9441 14.2411 22.1847 19.2972
temp: 298.150 k
press: 1.00000 atm
elementType: 7 7 7 6 6 6 6 6 6 6 6 6 6 6 6 6 6 6 1 1 1 1 1 1 1 1 1 1 1 1 1 1 1 1 1
symmnumber: 1
zpe: 756215.0 jmol-1
zpe.correction: 0.288027 hartree
zpe.thermalcorrener: 0.304838 hartree
zpe.thermalcorrenthalpy: 0.305782 hartree
zpe.thermalcorrgfe: 0.239744 hartree
zpe.sumelectzpe: -744.749970 hartree
zpe.sumelectthermal: -744.733160 hartree
zpe.sumelectthermalent: -744.732216 hartree
zpe.sumelectthermalfe: -744.798254 hartree
dipole: -1.9513 3.4767 0.1421
dipole: 3.9894
quadrupole: -99.4141 -88.7475 -108.3638
quadrupole: 3.7660 1.9551 4.5259
quadrupole: -0.5723 10.0943 -9.5220 3.7660 1.9551 4.5259
hfenergy: -745.0379976 hartree
pointgroup: C01 [X(C15H17N3)]
dipole: 0.8074698 -1.299529 0.350284 debye
polarizability: 253.7004434|4.14108|160.426761|-11.0017634|-30.8595534|129.982755 unknown
InChI: InChI=1S/C15H17N3/c16-15(17-11-13-7-3-1-4-8-13)18-12-14-9-5-2-6-10-14/h1-10,17H,11-12,16H2
charge 0 multiplicity 1
35 atoms
N  1.321998 -1.4834 -0.185602
N  -0.993895 -1.054303 -0.100312
N  -0.070423 -3.163114 0.672065
C  1.595639 -0.139772 -0.718111
C  3.044155 0.274214 -0.491582
C  -3.322527 -0.262076 0.264861
C  -2.33346 -1.423631 0.38218
C  3.666149 0.090233 0.770861
C  3.784876 0.885074 -1.5336
C  0.009994 -1.871525 0.120123
C  -4.655176 -0.426186 0.721856
C  -2.939271 0.977823 -0.296799
C  4.996902 0.510912 0.985455
C  5.116298 1.31155 -1.320947
C  5.727333 1.124986 -0.060022
C  -5.58791 0.629415 0.621351
C  -3.871143 2.037103 -0.398498
C  -5.19795 1.868618 0.059506
H  0.89463 0.544565 -0.204649
H  1.34537 -0.072071 -1.798266
H  -2.319363 -1.761758 1.447894
H  -2.750813 -2.277642 -0.204985
H  1.979766 -2.220519 -0.446777
H  3.095875 -0.382571 1.57878
H  3.317286 1.027732 -2.515923
H  -4.96647 -1.384209 1.160583
H  -1.907645 1.080817 -0.645115
H  5.463862 0.365927 1.966556
H  5.675395 1.782997 -2.1372
H  6.759756 1.452422 0.106612
H  -6.614173 0.488039 0.980132
H  -3.561259 2.993862 -0.835481
H  -5.919571 2.6900 -0.018862
H  0.735982 -3.591844 1.120504
H  -0.980119 -3.592868 0.808711
