program: Gaussian 09
title: 000033063
version: EM64L-G09RevD.01
frameworkgroup: C1[X(C18H18N2O2)]
method: RPBEPBE
basis: SDD
operation: Freq
keyword: #p
keyword: freq=noraman
keyword: PBEPBE/SDD
title: #p freq=noraman PBEPBE/SDD
converged: YES YES NO NO
title: Mulliken charges:
elementType: O O N N C C C C C C C C C C C C C C C C C C H H H H H H H H H H H H H H H H H H
charge: -0.302584 -0.260756 -0.128872 0.019962 -0.443720 -0.458143 -0.341121 -0.363528 -0.369152 0.071976 0.273542 -0.308865 -0.336000 0.330855 -0.378160 -0.396605 0.348180 -0.362127 -0.385307 -0.204864 -0.194139 -0.251339 0.233699 0.232696 0.232703 0.236070 0.248546 0.228586 0.246183 0.242847 0.234082 0.290856 0.281820 0.262101 0.256339 0.268978 0.257832 0.228108 0.229609 0.229711
chargesum: 0.00000
title: Mulliken charges with hydrogens summed into heavy atoms:
elementType: O O N N C C C C C C C C C C C C C C C C C C
charge: -0.302584 -0.260756 -0.128872 0.019962 0.022675 0.010630 0.136012 0.125502 -0.135070 0.071976 0.273542 -0.018009 -0.054180 0.330855 -0.116059 -0.140266 0.348180 -0.093149 -0.127475 0.023244 0.035470 -0.021627
polarizability: 3.45295087e+02 1.00346243e+01 2.50677953e+02 1.69908941e+01 -2.33987523e+00 1.32329838e+02
1716.lowfreq: -2.1952 -0.0007 -0.0006 0.0004 3.6471 7.0593 19.2991 25.8893 32.3208
frequency: 18.9592 25.6961 32.0801 43.0086 57.5309 64.4466 81.9410 117.3292 156.2420 161.8746 191.2571 203.2850 227.9482 237.0267 286.5465 289.6403 354.4092 366.3060 371.5539 410.0905 415.4936 428.2551 481.8422 494.7905 531.7987 570.2476 579.3080 599.2684 614.3303 632.1811 667.6101 678.0851 693.3115 709.4186 754.8571 760.9598 777.5569 799.7824 832.9850 846.1997 851.5518 854.2593 855.3127 864.6721 895.2035 906.9864 908.9228 926.7172 968.2407 983.1605 986.3934 986.9399 992.9447 999.7264 1004.9451 1020.5788 1058.6693 1077.9257 1081.2450 1104.3126 1109.2733 1151.6698 1154.8618 1159.8470 1169.0849 1173.0117 1173.7459 1186.7594 1209.8980 1220.4293 1235.4131 1248.7803 1294.4839 1300.3889 1304.0205 1309.3624 1311.2889 1334.9182 1336.9377 1367.0591 1383.7552 1386.5013 1418.6507 1442.6582 1469.7131 1472.1216 1472.8768 1484.3593 1488.2720 1492.8808 1500.7799 1529.6422 1579.7704 1596.2375 1601.2832 1616.6691 2959.6413 2970.7192 3008.4002 3016.2654 3022.8140 3060.4735 3067.7920 3083.9148 3097.8528 3130.7104 3140.1807 3151.1771 3152.3077 3156.6452 3165.5016 3170.6168 3174.8006 3179.2513
redmass: 4.3143 4.0614 3.4483 4.6687 3.9609 4.2393 5.0554 6.3966 3.5219 3.5241 5.9825 2.8500 4.5527 2.4978 4.6916 5.7325 4.8082 4.0744 6.2956 2.9402 3.0297 6.2789 3.6890 3.1745 6.6192 1.9212 6.6350 5.5563 6.4272 6.8508 5.1501 4.0245 2.3571 3.7780 2.6328 2.5186 3.3147 2.5320 1.2814 1.2739 2.2495 2.2752 2.5434 1.7011 1.5656 2.5923 1.4246 1.3813 1.3641 1.7325 1.6738 3.0309 1.3452 1.3430 2.9973 2.1006 1.9896 1.5220 3.4020 1.5103 1.3092 1.4762 1.9301 1.6707 1.1254 1.5448 1.7354 1.4321 1.4230 3.6433 2.0284 1.5624 1.3392 1.6191 1.4559 1.3419 1.2555 1.5292 1.4647 4.7849 4.3484 7.8923 4.3135 2.3197 1.0913 1.5826 1.3932 1.1172 2.4640 1.1368 7.4102 4.7568 7.5114 6.3805 6.5575 6.4934 1.0597 1.0675 1.0871 1.0633 1.0787 1.0867 1.0962 1.1010 1.1053 1.0849 1.0892 1.0882 1.0897 1.0929 1.0964 1.0964 1.1003 1.0954
irintensity: 0.3281 1.2198 0.5246 0.8731 0.1542 0.2134 1.3784 1.6145 2.4478 3.7291 3.2485 3.7401 0.7347 1.8241 0.5329 2.1220 10.1063 4.3054 21.9529 0.9771 0.9452 3.6650 14.0033 26.4207 1.1545 2.3373 7.8229 9.3279 3.8821 1.0654 2.6636 17.4028 18.6920 44.4645 43.0369 20.2117 25.2205 12.9764 3.5855 3.2262 18.9786 47.0522 39.4526 73.9712 22.8889 5.9874 5.3450 2.7212 0.3104 9.0198 0.1206 2.0306 1.7754 0.1260 15.0194 14.9938 12.2709 10.9857 30.5532 5.7367 23.5391 35.3157 3.5731 6.7826 38.9484 73.8597 80.2754 85.6892 44.5648 505.4055 95.3880 37.4711 51.5722 240.6839 128.8958 2.5590 15.0716 14.4196 26.4743 2.0938 61.3412 43.1420 37.7147 3.5496 12.7765 167.4845 70.7670 18.4091 29.6073 35.7264 145.1627 327.3780 52.9204 70.2417 179.4300 24.1254 37.0963 42.3027 10.8381 27.5388 49.6542 43.1522 21.4365 31.7022 50.5604 2.0253 11.7895 1.0094 8.5725 26.2045 13.6125 6.7375 8.0584 19.9186
temp: 298.150 k
press: 1.00000 atm
elementType: 8 8 7 7 6 6 6 6 6 6 6 6 6 6 6 6 6 6 6 6 6 6 1 1 1 1 1 1 1 1 1 1 1 1 1 1 1 1 1 1
symmnumber: 1
zpe: 839124.3 jmol-1
zpe.correction: 0.319606 hartree
zpe.thermalcorrener: 0.338925 hartree
zpe.thermalcorrenthalpy: 0.339869 hartree
zpe.thermalcorrgfe: 0.268552 hartree
zpe.sumelectzpe: -955.047192 hartree
zpe.sumelectthermal: -955.027872 hartree
zpe.sumelectthermalent: -955.026928 hartree
zpe.sumelectthermalfe: -955.098245 hartree
dipole: 3.4833 -6.8713 -0.0803
dipole: 7.7042
quadrupole: -92.3259 -133.2773 -127.3600
quadrupole: -12.6811 0.5353 -2.5350
quadrupole: 25.3285 -15.6229 -9.7056 -12.6811 0.5353 -2.5350
hfenergy: -955.3667971 hartree
pointgroup: C01 [X(C18H18N2O2)]
dipole: 1.4107446 2.6168647 -0.5909573 debye
polarizability: 346.1676365|-9.9315492|239.8310552|7.1297348|-35.1329683|142.3041858 unknown
InChI: InChI=1S/C18H18N2O2/c21-18(14-19-20-12-4-5-13-20)15-8-10-17(11-9-15)22-16-6-2-1-3-7-16/h1-3,6-11,14H,4-5,12-13H2
charge 0 multiplicity 1
40 atoms
O  -3.593638 -0.810724 0.48393
O  2.312864 -3.2338 0.933061
N  4.175423 0.989203 0.302078
N  3.068294 0.235283 0.394465
C  5.461269 2.97093 0.44153
C  6.399844 1.795327 0.046194
C  4.054519 2.449041 0.07509
C  5.586508 0.524473 0.393263
C  3.169068 -1.078212 0.605379
C  2.02249 -1.999225 0.72831
C  0.578558 -1.587723 0.630718
C  0.123513 -0.258453 0.40877
C  -0.392648 -2.619186 0.779994
C  -2.19427 -1.014632 0.470961
C  -1.253297 0.032549 0.329151
C  -1.766839 -2.342875 0.702738
C  -4.193599 0.26189 -0.225504
C  -3.776789 0.646306 -1.52159
C  -5.314587 0.861388 0.388705
C  -4.492217 1.659607 -2.197407
C  -6.022371 1.869868 -0.301445
C  -5.61282 2.276934 -1.593167
H  5.524098 3.161066 1.528244
H  5.710899 3.906076 -0.086106
H  6.608532 1.824166 -1.038487
H  7.364767 1.82622 0.578464
H  3.249522 2.861078 0.706186
H  3.805648 2.656355 -0.985485
H  5.770819 -0.308067 -0.313687
H  5.798839 0.150625 1.416435
H  4.136098 -1.5970 0.711897
H  0.85784 0.54304 0.306319
H  -0.030696 -3.637613 0.954235
H  -1.590686 1.061998 0.173935
H  -2.518924 -3.12895 0.818068
H  -2.921509 0.155006 -1.995916
H  -5.613867 0.528619 1.387035
H  -4.176683 1.958223 -3.203294
H  -6.89265 2.337682 0.171806
H  -6.163421 3.060206 -2.124773
