program: Gaussian 09
title: 000033041
version: EM64L-G09RevD.01
frameworkgroup: C1[X(C15H19NO)]
method: RPBEPBE
basis: SDD
operation: Freq
keyword: #p
keyword: freq=noraman
keyword: PBEPBE/SDD
title: #p freq=noraman PBEPBE/SDD
converged: YES YES NO NO
title: Mulliken charges:
elementType: O N C C C C C C C C C C C C C C C H H H H H H H H H H H H H H H H H H H
charge: -0.248950 -0.117868 -0.163764 -0.453166 -0.510181 0.461273 0.381599 -0.633177 -0.640822 -0.451385 -0.374217 -0.447032 -0.231544 -0.237833 -0.244960 -0.261243 -0.185511 0.180854 0.229481 0.241702 0.254302 0.208916 0.253796 0.186504 0.217399 0.216263 0.189796 0.244357 0.237033 0.263341 0.258454 0.223800 0.223373 0.226272 0.249016 0.254120
chargesum: 0.00000
title: Mulliken charges with hydrogens summed into heavy atoms:
elementType: O N C C C C C C C C C C C C C C C
charge: -0.248950 -0.117868 0.017089 0.018017 -0.046963 0.461273 0.381599 0.024523 0.009595 -0.214352 -0.110876 -0.188578 -0.007745 -0.014460 -0.018687 -0.012227 0.068609
polarizability: 1.81456344e+02 -2.01405650e+01 1.75930193e+02 2.59354782e+00 5.47495513e+00 1.35020234e+02
1716.lowfreq: -7.2151 -4.3545 0.0002 0.0004 0.0007 5.8461 27.7655 36.0510 47.8646
frequency: 27.7446 36.0141 47.8096 61.3649 73.4014 78.0186 113.5355 161.8182 186.3310 219.0948 224.8287 257.2657 292.4040 302.8335 320.2130 347.0990 384.0310 406.3887 454.2059 505.1109 553.6973 593.9172 601.0935 615.6401 631.3372 703.2690 709.6999 716.8842 750.5584 776.9136 804.7421 817.0662 845.2382 859.5323 870.4726 871.1653 884.9389 928.4445 973.6072 980.3442 990.2883 995.9389 1005.0004 1017.8992 1025.2803 1030.8924 1033.9441 1045.5864 1072.2422 1081.6128 1092.5930 1129.2907 1130.7121 1138.2119 1170.1950 1181.1740 1196.4998 1202.9042 1215.7744 1227.1344 1240.4082 1269.8663 1283.3285 1305.7118 1316.6258 1334.1955 1350.5903 1364.4784 1384.5650 1417.5092 1438.9680 1444.5153 1453.0354 1463.2881 1470.4241 1473.1243 1479.6159 1482.6051 1489.1953 1493.5337 1592.5499 1593.3719 1611.2294 2799.0602 2851.1574 2865.4638 2968.1921 3000.5039 3030.8304 3036.0202 3053.9948 3077.1498 3092.3250 3096.0146 3111.9148 3122.6046 3135.3778 3147.0263 3161.1170 3215.5188 3230.9012 3265.7402
redmass: 4.1278 4.2864 3.8674 3.9219 2.8116 4.0793 2.5697 4.1705 2.6573 2.0644 1.1548 1.6455 3.0134 2.8379 3.0894 3.5501 2.8516 2.8331 2.5572 3.0698 2.9421 3.1803 3.8128 6.3872 4.0385 2.5749 1.9868 1.3395 1.9688 2.1752 1.7113 1.3897 3.9391 1.2578 5.6006 1.4118 3.5548 1.4649 2.1150 1.4175 4.9387 1.3432 2.2673 2.1729 2.0538 1.5406 2.8921 2.3776 2.1767 1.6403 1.4311 1.4564 1.4761 1.5594 1.0598 1.1165 2.9664 2.0052 2.0674 1.9556 1.9153 1.4605 1.3057 1.4469 1.2610 1.4253 1.6057 2.1042 5.5086 1.1416 1.7787 1.3060 1.0885 1.0633 1.0677 1.1152 1.7782 1.1670 1.0523 5.0311 6.1716 6.8559 6.1541 1.0803 1.0572 1.0571 1.0663 1.0596 1.0734 1.0731 1.0944 1.1015 1.0992 1.0995 1.0869 1.0861 1.0914 1.0954 1.1013 1.0918 1.0989 1.1082
irintensity: 0.2785 0.4997 0.0902 0.7980 0.6710 0.4898 0.2178 0.6324 0.2815 0.7541 0.4393 0.8347 7.3407 0.4250 7.7368 0.6463 2.0558 0.0934 0.5093 3.6085 17.5353 4.8805 1.8396 0.1206 3.7022 12.2211 51.4243 71.6341 22.2360 26.6017 4.7214 32.5559 25.0097 0.3222 1.5172 0.0348 14.6135 8.6388 26.3152 0.9021 1.8342 2.4375 4.8514 44.9631 4.8908 8.8941 9.6762 0.8120 6.2732 8.0298 12.6262 16.8559 14.8340 0.7472 0.1669 0.2599 7.4137 11.1093 2.4090 4.5234 1.0161 4.4836 4.8582 9.9131 6.9672 2.7502 18.5641 4.8167 3.1878 2.0553 9.6994 12.1309 4.3707 17.7400 7.3290 3.6257 9.7013 8.7638 24.5208 17.2648 1.3750 24.1037 4.6669 63.1624 66.9957 196.2775 18.4279 19.6413 29.8600 54.1293 0.2754 33.5614 30.9164 33.0369 8.5740 0.3073 20.3597 30.9967 25.6035 6.3724 0.6457 1.0528
temp: 298.150 k
press: 1.00000 atm
elementType: 8 7 6 6 6 6 6 6 6 6 6 6 6 6 6 6 6 1 1 1 1 1 1 1 1 1 1 1 1 1 1 1 1 1 1 1
symmnumber: 1
zpe: 795426.3 jmol-1
zpe.correction: 0.302962 hartree
zpe.thermalcorrener: 0.319505 hartree
zpe.thermalcorrenthalpy: 0.320449 hartree
zpe.thermalcorrgfe: 0.256968 hartree
zpe.sumelectzpe: -711.659210 hartree
zpe.sumelectthermal: -711.642667 hartree
zpe.sumelectthermalent: -711.641723 hartree
zpe.sumelectthermalfe: -711.705204 hartree
dipole: 0.2138 -0.0634 0.2398
dipole: 0.3275
quadrupole: -98.3403 -94.8525 -100.5289
quadrupole: -1.4354 2.7937 1.8816
quadrupole: -0.4331 3.0547 -2.6217 -1.4354 2.7937 1.8816
hfenergy: -711.9621722 hartree
pointgroup: C01 [X(C15H19N1O1)]
dipole: 0.082659 -0.0247177 0.0956763 debye
polarizability: 183.6590981|-19.9837464|172.9519871|2.6775209|6.9436381|135.7956856 unknown
InChI: InChI=1S/C15H19NO/c1-16(2)15(13-7-4-3-5-8-13)11-10-14-9-6-12-17-14/h3-9,12,15H,10-11H2,1-2H3
charge 0 multiplicity 1
36 atoms
O  -3.584348 0.415702 0.454374
N  1.44041 2.343348 -0.169086
C  0.82998 1.133169 0.462443
C  -0.597945 0.864937 -0.094911
C  -1.24402 -0.41639 0.497951
C  1.728044 -0.087789 0.233748
C  -2.670105 -0.602294 0.07943
C  2.765809 2.654902 0.416278
C  0.573878 3.542793 -0.160198
C  2.084976 -0.944709 1.302423
C  2.179287 -0.401177 -1.074451
C  -3.35585 -1.5847 -0.617852
C  2.873693 -2.096926 1.073625
C  2.967448 -1.548983 -1.307118
C  3.31587 -2.403963 -0.233263
C  -4.748275 -1.182435 -0.690279
C  -4.849261 0.029817 -0.033246
H  0.728255 1.284221 1.572896
H  -0.54356 0.780596 -1.197029
H  -1.259885 1.71557 0.143698
H  -0.676446 -1.310552 0.187126
H  -1.181957 -0.369123 1.605296
H  3.436576 1.785739 0.320323
H  2.710107 2.931559 1.500064
H  3.218674 3.500924 -0.130652
H  1.137926 4.387325 -0.594278
H  0.242586 3.844362 0.866236
H  -0.321964 3.389238 -0.782565
H  1.749942 -0.70641 2.319988
H  1.925867 0.281403 -1.893458
H  -2.917176 -2.490432 -1.032537
H  3.144967 -2.748848 1.911984
H  3.313812 -1.777458 -2.321808
H  3.928928 -3.294518 -0.412953
H  -5.561542 -1.725193 -1.168365
H  -5.664099 0.716796 0.176969
