program: Gaussian 09
title: 000033354
version: EM64L-G09RevD.01
frameworkgroup: C1[X(C22H24FNO6)]
method: RPBEPBE
basis: SDD
operation: Freq
keyword: #p
keyword: freq=noraman
keyword: PBEPBE/SDD
title: #p freq=noraman PBEPBE/SDD
converged: YES YES NO NO
title: Mulliken charges:
elementType: F O O O O O O N C C C C C C C C C C C C C C C C C C C C C C H H H H H H H H H H H H H H H H H H H H H H H H
charge: -0.250980 -0.308351 -0.310183 -0.283317 -0.266891 -0.283684 -0.263415 -0.373181 -0.354653 -0.409900 -0.650248 0.516341 0.503396 -0.047537 0.339841 0.110173 -0.658634 -0.565120 -0.318696 0.018755 0.227905 0.061031 0.171857 -0.348043 0.210017 -0.317317 -0.528546 -0.525349 -0.522094 -0.504437 0.276360 0.227383 0.233691 0.237012 0.233002 0.375442 0.267287 0.239506 0.237266 0.238295 0.242032 0.243607 0.239062 0.255433 0.229114 0.231920 0.229483 0.252989 0.264645 0.218656 0.230256 0.279327 0.225114 0.224379
chargesum: 0.00000
title: Mulliken charges with hydrogens summed into heavy atoms:
elementType: F O O O O O O N C C C C C C C C C C C C C C C C C C C C C C
charge: -0.250980 -0.308351 -0.310183 -0.283317 -0.266891 -0.283684 -0.263415 0.002260 -0.078293 0.051173 -0.180234 0.516341 0.503396 -0.047537 0.339841 0.110173 -0.391347 -0.325614 -0.081430 0.018755 0.227905 0.061031 0.171857 -0.109748 0.210017 0.168321 0.195064 0.189043 0.191463 0.224384
polarizability: 4.39272492e+02 -1.94202892e+00 2.58692864e+02 -1.32038736e+01 2.00041727e+01 2.10517539e+02
1716.lowfreq: -0.0009 -0.0005 0.0004 2.1262 3.0796 9.5145 21.4206 27.3332 29.8218
frequency: 21.2811 27.2526 29.7556 32.4931 44.7383 55.4762 66.2526 72.9445 80.3705 83.4887 100.5993 102.6657 114.6079 126.9869 128.8548 139.3047 151.7229 156.1529 165.6200 173.4966 175.9520 187.3999 215.3604 221.7914 227.8426 254.3586 267.1100 272.2940 293.2128 304.5600 329.6926 344.6316 358.4167 365.7730 384.5021 389.4811 404.8186 410.6952 437.7196 455.5634 463.7104 484.7582 509.3377 533.1210 547.9829 568.8660 582.9896 585.2454 612.6780 624.4137 649.5299 676.1623 681.8266 688.7237 724.0131 735.6443 744.1798 779.3327 787.4908 795.9297 841.7824 858.6139 867.5075 878.4847 885.6910 900.2240 915.9024 921.7539 925.0771 952.4121 962.2915 975.4650 994.1735 998.5373 1000.1586 1038.0328 1061.2780 1077.0848 1098.9553 1102.8191 1106.4768 1111.2682 1112.8474 1114.4845 1127.5898 1152.3794 1155.4173 1156.2537 1158.4876 1169.7750 1172.7355 1200.4554 1220.6703 1230.4515 1236.8127 1248.0879 1276.4854 1283.2060 1303.2751 1326.6316 1330.3540 1339.5087 1345.5078 1353.8460 1365.9930 1381.2475 1387.3489 1416.9128 1427.2728 1429.9532 1436.2966 1437.5658 1444.5720 1449.4648 1450.3364 1454.3579 1459.0848 1461.1027 1462.1905 1466.7865 1472.3256 1477.1392 1483.8532 1485.2438 1486.6012 1487.6195 1523.2211 1547.3069 1577.5463 1592.3492 1603.8541 1619.2158 2977.9734 2980.6243 2987.5493 2987.7669 2993.3948 3005.5491 3037.5942 3041.7830 3048.7352 3061.2677 3078.8465 3088.8622 3090.5162 3103.9327 3113.5259 3115.0214 3117.7828 3122.6491 3129.7888 3132.2316 3146.8043 3153.9730 3153.9982 3518.0266
redmass: 7.3022 8.1003 8.3248 5.0467 4.9364 3.4930 3.9507 2.3399 2.2656 2.9972 2.4378 3.0682 2.7337 1.8818 1.7965 3.3132 3.6509 1.5527 1.9138 1.4310 2.1228 4.2408 4.1291 5.7889 4.6165 4.7036 4.5899 4.3972 4.3254 5.2284 4.8247 4.6401 4.9172 4.0635 5.1454 4.9638 6.2094 4.2394 4.8888 7.3154 7.0115 4.6304 4.9854 5.3582 4.9273 4.5866 4.2101 4.7069 5.1185 4.2782 4.7567 3.4872 1.5638 3.4868 3.7931 4.1556 4.8022 5.5277 5.0091 4.1077 2.9751 1.5137 4.9150 2.7868 1.9357 5.5162 6.3298 1.6641 7.9529 7.6677 3.8458 1.3978 3.4640 2.1610 3.0668 4.2223 3.1345 2.6727 3.5320 1.4606 1.8612 1.2542 1.2816 1.2698 3.1102 1.3544 1.5785 1.5155 1.4905 1.0745 1.3460 1.9360 1.5880 2.5725 2.7077 2.1372 1.7851 1.3643 2.9852 1.6275 1.2767 2.0246 3.3995 1.3835 1.7252 2.2619 1.8290 1.3316 1.3221 1.3182 1.3348 1.0804 2.0539 1.3457 1.1850 1.1323 1.0641 1.2075 1.5186 1.0953 1.1107 1.0749 1.8083 1.1947 1.8901 1.3385 4.2373 7.9724 4.7767 7.4293 7.5222 8.8042 1.0297 1.0335 1.0596 1.0293 1.0632 1.0307 1.0562 1.0901 1.0946 1.1028 1.1052 1.0988 1.1052 1.0871 1.1029 1.1098 1.0861 1.1031 1.1041 1.1049 1.0909 1.0991 1.0973 1.0769
irintensity: 1.0206 3.1226 0.1744 1.8339 0.6587 2.4962 3.0717 2.7029 2.8107 4.6478 7.2449 1.9138 12.9960 1.0337 0.5719 5.6623 2.2142 3.0244 5.1564 1.3568 0.2285 3.1456 4.8339 12.1171 3.0364 13.5781 2.4340 10.9984 5.0460 12.0478 1.8915 2.9914 9.9292 3.4942 5.8121 0.9095 2.3868 9.7031 8.6258 3.4003 17.8381 23.8976 2.3065 0.4591 4.5864 8.2438 9.7752 3.1839 1.8991 2.5456 12.5968 27.6976 23.1393 24.1230 19.1699 5.4596 11.3694 0.2167 13.7586 6.9684 6.5274 23.8943 7.6278 27.4449 10.3811 31.0500 74.7668 15.3509 6.2167 47.6680 18.1795 2.3240 53.4093 15.0829 44.1077 98.0919 21.4039 15.0803 38.3002 48.9486 40.3013 11.3397 1.1321 5.4688 3.3738 2.9693 34.6300 11.0142 14.9268 0.8453 25.6441 34.2210 75.5717 268.1647 142.9603 4.8159 15.0451 3.2879 131.4619 26.8373 8.4501 1.5914 72.4557 28.4689 92.9972 30.4850 10.8927 9.8297 141.1731 21.4346 10.9997 23.0489 67.5053 26.0452 14.7370 24.0749 24.0180 26.8597 62.8361 33.6127 18.4123 6.8746 232.7626 24.4666 184.9553 55.4873 85.5094 34.2195 25.7935 18.5034 117.3096 272.1677 68.7758 90.1693 18.1590 54.0455 34.6865 89.6562 19.5647 1.9691 24.5283 33.4147 21.0363 31.9789 19.3014 3.0415 39.1125 6.8558 8.1212 23.9218 15.1564 16.0639 5.8113 7.5971 5.0517 82.0441
temp: 298.150 k
press: 1.00000 atm
elementType: 9 8 8 8 8 8 8 7 6 6 6 6 6 6 6 6 6 6 6 6 6 6 6 6 6 6 6 6 6 6 1 1 1 1 1 1 1 1 1 1 1 1 1 1 1 1 1 1 1 1 1 1 1 1
symmnumber: 1
zpe: 1106039.6 jmol-1
zpe.correction: 0.421268 hartree
zpe.thermalcorrener: 0.451746 hartree
zpe.thermalcorrenthalpy: 0.452690 hartree
zpe.thermalcorrgfe: 0.358013 hartree
zpe.sumelectzpe: -1456.374044 hartree
zpe.sumelectthermal: -1456.343567 hartree
zpe.sumelectthermalent: -1456.342623 hartree
zpe.sumelectthermalfe: -1456.437300 hartree
dipole: -4.4340 -3.2596 0.5853
dipole: 5.5343
quadrupole: -173.6608 -176.9778 -166.1456
quadrupole: -13.9791 14.3533 6.0104
quadrupole: -1.3994 -4.7164 6.1159 -13.9791 14.3533 6.0104
hfenergy: -1456.7953126 hartree
pointgroup: C01 [X(C22H24F1N1O6)]
dipole: 1.604423 1.4689299 0.0947121 debye
polarizability: 438.5426231|16.7035767|259.2018724|1.8150571|-20.9283532|210.7383999 unknown
InChI: InChI=1S/C22H24FNO6/c1-27-17-8-6-13-14(10-16(17)25)15(24-19(26)11-23)7-5-12-9-18(28-2)21(29-3)22(30-4)20(12)13/h6,8-10,15,24H,5,7,11H2,1-4H3
charge 0 multiplicity 1
54 atoms
F  2.193409 -2.065938 -2.047499
O  0.671563 1.825185 -1.494109
O  3.441841 2.313202 -1.126792
O  4.731041 1.262788 1.261841
O  -5.364416 1.672215 0.043617
O  -5.180664 -1.178035 0.014353
O  -0.259785 -4.410041 -0.688792
N  0.412056 -2.240335 -0.078853
C  -0.601668 -2.057766 0.983676
C  0.021281 -1.997641 2.413534
C  0.445414 -0.577912 2.876612
C  -1.528977 -0.85735 0.67783
C  1.231182 0.167103 1.812951
C  0.552416 0.635677 0.642136
C  -0.932123 0.454068 0.491642
C  1.32116 1.322422 -0.34554
C  2.619423 0.361819 1.954927
C  -2.881054 -1.19361 0.579712
C  -1.664165 1.619033 0.200436
C  2.713634 1.564596 -0.170057
C  3.375523 1.048269 0.976414
C  -4.117768 -0.484916 0.248273
C  0.468917 -3.381118 -0.838074
C  -3.05802 1.858163 0.085074
C  -4.160481 0.998195 0.168117
C  1.522887 -3.3743 -1.948481
C  1.129846 1.245524 -2.785197
C  3.100728 3.757967 -1.136389
C  5.715953 0.966223 0.195119
C  -6.667499 1.090642 0.454285
H  -1.203231 -2.981554 0.933293
H  -0.721637 -2.395191 3.131316
H  0.88924 -2.683322 2.428433
H  -0.465547 -0.003052 3.131563
H  1.041669 -0.665426 3.802441
H  1.06334 -1.480646 -0.295337
H  3.145577 -0.003122 2.8426
H  -3.112372 -2.262202 0.698379
H  -1.057366 2.522731 0.078231
H  -3.342602 2.90621 -0.075645
H  2.303366 -4.126366 -1.741102
H  1.039693 -3.57528 -2.919211
H  1.002908 0.148227 -2.773225
H  2.187839 1.500042 -2.968911
H  0.478147 1.69863 -3.547056
H  3.330722 4.207616 -0.152935
H  3.737601 4.204676 -1.915108
H  2.033575 3.898897 -1.384022
H  5.517138 1.569243 -0.704926
H  5.684901 -0.111252 -0.055428
H  6.691874 1.221303 0.634787
H  -6.93991 0.247535 -0.194073
H  -6.622062 0.744921 1.501532
H  -7.364818 1.937154 0.358034
