program: Gaussian 09
title: 000033025
version: EM64L-G09RevD.01
frameworkgroup: C1[X(C12H9N3O2)]
method: RPBEPBE
basis: SDD
operation: Freq
keyword: #p
keyword: freq=noraman
keyword: PBEPBE/SDD
title: #p freq=noraman PBEPBE/SDD
converged: NO YES NO NO
title: Mulliken charges:
elementType: O O N N N C C C C C C C C C C C C H H H H H H H H H
charge: -0.164343 -0.231308 -0.227315 -0.021403 0.016608 0.152952 0.015736 -0.065874 0.373053 0.205604 -0.247356 -0.395127 -0.372067 -0.592350 -0.234710 -0.227432 -0.236799 0.290305 0.231499 0.264400 0.249301 0.245312 0.271409 0.232102 0.232785 0.235017
chargesum: 0.00000
title: Mulliken charges with hydrogens summed into heavy atoms:
elementType: O O N N N C C C C C C C C C C C C
charge: -0.164343 -0.231308 -0.227315 -0.021403 0.016608 0.152952 0.015736 -0.065874 0.373053 0.205604 0.042949 -0.163628 -0.107667 0.173672 -0.002608 0.005353 -0.001782
polarizability: 2.46565952e+02 1.16189815e+01 1.71189718e+02 -2.04010458e+00 8.87009425e+00 7.34646053e+01
1716.lowfreq: -5.9425 -5.1053 -3.5575 -0.0007 -0.0005 -0.0004 48.8676 59.7002 74.2008
frequency: 48.8665 59.6984 74.1697 91.7248 113.6751 167.7082 223.1834 247.9356 265.5455 295.4979 316.1958 349.2028 389.1742 404.4574 457.1379 491.2480 504.5003 566.2559 593.9641 615.1359 620.7438 663.4641 679.0090 701.6888 710.3152 759.5689 765.3905 778.7152 806.2373 854.9361 876.9534 890.6473 929.4005 970.1481 980.6467 990.0568 1000.4912 1011.6504 1032.8962 1051.3694 1087.2472 1126.2092 1158.4471 1174.8977 1177.8853 1192.1393 1224.5692 1260.4227 1317.9872 1333.2424 1371.4059 1381.9250 1412.8344 1418.4817 1437.3776 1471.5409 1477.6029 1478.5559 1495.9790 1570.0560 1587.9872 1612.3941 1617.4893 3013.0845 3106.6861 3129.3338 3137.8180 3145.5147 3150.1318 3161.4359 3172.2478 3257.3436
redmass: 3.9280 7.1866 1.0473 4.6114 5.1361 5.6883 5.0588 5.9556 8.4491 5.2478 5.3757 5.0277 6.1621 2.8737 6.3560 4.4746 8.9659 5.3059 7.3765 6.4323 7.4614 5.4019 5.8154 1.8388 8.0468 3.5040 5.9805 1.9352 2.2573 1.2500 7.7887 7.0499 1.4328 3.6505 1.5068 4.8522 1.3408 4.0966 2.1307 4.2649 1.6127 1.3075 4.3238 1.1318 2.5193 1.1397 1.9537 3.1839 1.4051 4.9348 9.6958 7.6849 2.4465 1.8267 2.5247 1.4106 1.9695 1.0450 3.5700 7.9269 6.5048 6.3745 10.5078 1.0334 1.1028 1.0849 1.0881 1.1012 1.0931 1.0961 1.1004 1.1005
irintensity: 0.1778 2.9068 0.0031 1.2664 0.6027 2.7158 1.7166 0.4171 5.5198 0.4830 1.1659 9.0033 0.9913 0.1309 21.8193 8.6179 2.0893 1.7303 2.5771 0.7653 4.7171 21.1343 26.8794 48.3816 8.1375 14.8578 30.2410 18.4179 27.2858 1.7738 1.5913 15.1031 4.6626 18.4004 1.8925 0.0584 0.4999 97.0337 5.3556 34.4221 13.6311 0.3775 33.2099 1.9958 18.8450 1.2394 21.4175 86.8244 4.8782 8.5985 25.6718 4.5736 3.3767 70.0412 27.5158 10.0980 47.2262 20.3313 1.4952 10.6701 1.9392 32.3798 289.1760 32.8400 17.2635 2.5791 3.4594 0.1931 26.8874 20.4595 15.1127 3.6219
temp: 298.150 k
press: 1.00000 atm
elementType: 8 8 7 7 7 6 6 6 6 6 6 6 6 6 6 6 6 1 1 1 1 1 1 1 1 1
symmnumber: 1
zpe: 496509.3 jmol-1
zpe.correction: 0.189110 hartree
zpe.thermalcorrener: 0.202633 hartree
zpe.thermalcorrenthalpy: 0.203577 hartree
zpe.thermalcorrgfe: 0.148085 hartree
zpe.sumelectzpe: -776.132463 hartree
zpe.sumelectthermal: -776.118940 hartree
zpe.sumelectthermalent: -776.117996 hartree
zpe.sumelectthermalfe: -776.173488 hartree
dipole: 6.0832 -1.1559 -0.1193
dipole: 6.1932
quadrupole: -110.5422 -89.5863 -98.2260
quadrupole: 10.7837 -0.4200 3.4495
quadrupole: -11.0907 9.8652 1.2255 10.7837 -0.4200 3.4495
hfenergy: -776.321573 hartree
pointgroup: C01 [X(C12H9N3O2)]
dipole: -2.3929658 -0.3659861 0.2769157 debye
dipolederiv: -0.1110402 -0.1807545 0.0378694 -0.0482871 -0.5650704 0.0997655 0.0137423 0.1048505 -0.1601363 -1.5386651 0.1185156 0.0445833 0.1509512 -0.4339048 0.0111616 0.0498098 0.0226977 -0.3400909 -1.3403965 0.4959839 -0.0775136 -0.7444677 -0.170457 0.0361023 0.244403 -0.0003218 -0.1737813 0.4933403 -0.5886642 0.1381286 0.0960689 -0.2530803 0.0206925 0.0380573 0.0299958 -0.1414988 -0.1021299 -0.0845085 0.0258893 -0.0958342 0.0390596 -0.0287399 0.0358639 -0.0378234 -0.1148469 -0.3001369 0.1380178 -0.0206329 0.0753541 -0.1409991 0.0452587 -0.0065573 0.0325918 0.0370254 0.6378952 0.1721895 -0.0712426 0.2260678 0.0885716 0.0195657 -0.0625938 0.0080453 0.0430339 0.0435774 -0.0258609 0.0095588 0.2309199 -0.1358029 0.0309456 -0.0650255 0.054414 0.0530013 0.0865653 -0.0325905 0.017772 -0.0952535 -0.0453208 0.0078975 -0.057277 0.0189414 -0.0119171 1.8816955 -0.0698228 -0.1022835 0.4235455 0.5371843 -0.0910952 -0.2636363 -0.0725031 0.2776822 0.0720132 0.2274513 -0.0614712 0.0012327 0.3799743 -0.0726382 -0.0323931 -0.0814343 -0.0081013 -0.0484784 0.0340148 -0.0620296 -0.0420479 -0.0993051 -0.0718951 -0.0358544 -0.0807794 -0.0469161 -0.1096838 -0.061429 0.0609124 0.0170145 -0.0505899 -0.0858488 0.02846 -0.0521091 -0.0566072 0.059703 -0.1494206 0.05062 -0.1655207 0.4002025 -0.0550942 0.0489627 -0.0636765 0.2060427 -0.0778062 -0.0690861 0.065002 -0.1291404 -0.029101 -0.1139183 0.1423703 -0.1180286 -0.0331876 -0.0195531 0.0765495 -0.0865901 0.0923334 -0.0278453 -0.1244556 -0.1133745 -0.115915 -0.0167698 0.0459895 -0.0074611 -0.0052454 0.0145042 -0.098054 -0.0519168 -0.0319247 -0.055149 -0.0979544 0.0683975 0.0246175 -0.0063243 0.0274259 0.1412103 0.0045985 -0.0034657 0.0238156 0.1969126 0.0613479 -0.0614071 0.0814669 -0.0431225 0.0479469 0.0966705 0.1056985 0.0845074 0.03727 0.0827612 0.0588957 -0.0628144 0.02788 0.0770071 0.0818528 -0.0583062 0.0592436 0.0784377 0.1133285 -0.0826487 -0.0718272 -0.0081608 -0.051067 -0.0369629 -0.0487923 -0.0849953 0.0087051 0.1251471 -0.0217942 0.0888992 0.023946 0.0241818 0.0189914 0.02399 0.077673 -0.085476 -0.01965 0.076361 -0.0135791 -0.0569367 0.1387261 0.0036401 0.0257188 -0.0048038 0.1358766 0.0177135 0.0547354 -0.050712 0.0839208 0.0462615 0.1114859 -0.0712044 0.1115962 0.0455376 0.0102947 -0.0519832 0.0624356 -0.0751847 0.053972 0.1082837 0.0820121 0.1076452 0.0401708 -0.1322296 0.0100994 0.0091283 0.0127914 0.1262996 0.0356525 0.0113166 0.0315218 0.1275877 unknown
polarizability: 246.00373|-14.6218775|154.7815388|-3.8142828|-37.5704198|90.4350073 unknown
InChI: InChI=1S/C12H9N3O2/c1-15-12(16)11-9(7-17-14-11)10(13-15)8-5-3-2-4-6-8/h2-7H,1H3
charge 0 multiplicity 1
26 atoms
O  1.740771 2.80738 -0.889585
O  3.977832 -0.878019 -0.084155
N  1.760131 -1.58233 0.29636
N  0.377141 -1.431185 0.311965
N  2.806636 1.811803 -0.708035
C  0.681914 0.865125 -0.377759
C  -0.1737 -0.254302 -0.021906
C  2.119084 0.682582 -0.40324
C  -1.656986 -0.182989 0.010725
C  2.744245 -0.612897 -0.072667
C  0.503867 2.212197 -0.679496
C  -2.374174 0.699355 -0.842308
C  -2.386926 -1.026313 0.892542
C  2.203299 -2.937251 0.685982
C  -3.784308 0.747442 -0.802731
C  -3.79434 -0.97583 0.930527
C  -4.500652 -0.084624 0.087216
H  -0.355452 2.87236 -0.756438
H  -1.840386 1.314134 -1.575008
H  -1.833361 -1.712643 1.540372
H  1.761074 -3.681049 0.003532
H  1.875011 -3.151596 1.716171
H  3.300064 -2.968062 0.622871
H  -4.32288 1.425543 -1.473712
H  -4.342344 -1.626619 1.620573
H  -5.594762 -0.043512 0.120202
