program: Gaussian 09
title: 000033028
version: EM64L-G09RevD.01
frameworkgroup: C1[X(C18H13N3O2)]
method: RPBEPBE
basis: SDD
operation: Freq
keyword: #p
keyword: freq=noraman
keyword: PBEPBE/SDD
title: #p freq=noraman PBEPBE/SDD
converged: YES YES NO NO
title: Mulliken charges:
elementType: O O N N N C C C C C C C C C C C C C C C C C C H H H H H H H H H H H H H
charge: -0.197993 -0.207170 -0.331189 -0.037137 0.015193 0.013620 0.007054 -0.070410 0.253453 0.139611 0.338905 0.474165 -0.779659 -0.380309 -0.384066 -0.334900 -0.363432 -0.230219 -0.239843 -0.226427 -0.214831 -0.238423 -0.243596 0.252704 0.262617 0.271495 0.263446 0.242197 0.281617 0.272260 0.233719 0.234169 0.229772 0.228021 0.234997 0.230590
chargesum: 0.00000
title: Mulliken charges with hydrogens summed into heavy atoms:
elementType: O O N N N C C C C C C C C C C C C C C C C C C
charge: -0.197993 -0.207170 -0.331189 -0.037137 0.015193 0.013620 0.007054 -0.070410 0.253453 0.139611 0.338905 0.474165 0.007157 -0.116862 -0.141869 -0.053284 -0.091172 0.003500 -0.005674 0.003345 0.013190 -0.003427 -0.013007
polarizability: 3.41110342e+02 -2.80988795e+00 2.57422091e+02 -1.37333712e+01 -1.30857601e+00 1.12471637e+02
1716.lowfreq: -8.6887 -3.8900 -1.1843 -0.0006 -0.0005 -0.0001 29.4060 37.0815 53.0818
frequency: 29.3782 37.0765 53.0740 65.5084 69.9129 97.8350 118.0611 145.1710 155.7161 223.0089 238.1773 248.5161 257.8300 269.7587 301.0650 311.9076 345.7745 383.8231 403.6292 408.8595 426.0559 481.4244 491.8040 529.4396 567.6719 583.3481 604.2223 613.3510 618.1872 628.0798 663.2766 680.0045 687.3916 696.5881 707.8734 729.0093 766.7957 769.6246 780.9842 785.8948 830.9134 838.2428 859.4210 917.7618 929.0378 931.8745 956.9491 971.7616 982.6790 988.3267 989.6854 992.5615 999.9571 1002.9295 1026.3558 1030.3797 1042.1928 1050.1990 1082.8775 1097.5656 1107.2602 1161.2064 1173.1196 1174.8035 1189.5338 1191.5053 1226.3441 1247.5651 1316.9760 1322.9270 1341.4260 1378.0099 1384.9413 1403.3275 1406.2897 1429.3724 1438.0961 1443.3664 1454.7255 1462.5140 1477.9482 1486.4558 1495.5353 1582.7925 1594.3760 1595.5962 1606.5362 1611.3009 1615.4878 2992.2974 3076.6747 3123.7476 3127.9676 3131.5769 3136.1415 3144.4188 3147.9973 3159.1841 3162.7264 3170.7681 3185.2838 3204.1655
redmass: 4.7529 4.1736 4.3340 6.5952 4.3453 4.3952 1.8734 2.0947 3.8062 4.0308 6.9714 5.8955 5.6175 5.6308 5.8352 5.6157 10.1265 5.1855 2.9362 2.8855 6.0907 3.9444 7.5111 4.1208 7.5076 8.2183 6.5857 6.3641 6.5476 8.3069 6.7134 5.4176 3.4424 2.9066 1.8342 6.6958 1.8418 5.3857 3.0776 5.0227 5.9831 1.3429 1.2460 1.4543 2.3310 1.5825 5.6047 1.3921 1.4071 4.4577 5.5305 1.4329 1.4624 3.7991 2.4618 2.2152 1.4806 4.0109 1.6696 1.6889 4.6137 3.3727 1.0534 1.0543 1.1261 1.1387 4.6973 5.7547 1.3802 1.3265 5.8746 7.5059 9.6725 2.6511 1.8636 2.6749 3.8930 2.3956 1.0928 1.1340 2.2849 3.2865 4.3585 6.2643 6.6439 8.6850 6.1374 6.2972 11.1699 1.0405 1.0939 1.0986 1.0857 1.0855 1.0881 1.0909 1.0931 1.0961 1.0976 1.1008 1.0951 1.0950
irintensity: 1.5320 1.3421 0.1921 0.6548 0.4512 1.1053 0.7528 0.3877 0.0705 1.0309 3.0271 2.2058 2.0498 1.9013 2.1297 7.4409 3.6262 0.9947 0.9644 0.2934 0.6169 6.5914 1.4618 8.5808 12.8449 0.4073 3.8673 2.0354 2.2800 10.9458 17.8110 3.0162 37.6929 15.7440 64.1425 6.6594 38.7271 8.6481 58.1222 7.6339 2.8477 0.9644 1.3678 4.6562 7.4615 13.4004 8.8639 1.5706 2.0673 0.4530 0.2522 0.4248 2.6865 24.4711 16.2343 31.6403 4.6446 73.6369 10.6572 39.6242 44.5762 56.1965 0.8009 0.0708 5.1735 6.3802 20.5345 42.4145 4.2174 1.7608 11.3685 0.5346 2.0358 0.5168 10.6248 43.7288 67.8056 28.8231 13.8758 37.4577 69.2728 1.1044 1.0966 10.3665 7.5445 31.5752 14.4237 17.0072 237.4535 8.3023 5.7954 4.5455 1.9240 0.1338 2.1296 18.5716 23.6491 22.5271 38.3929 15.7102 3.5457 1.4715
temp: 298.150 k
press: 1.00000 atm
elementType: 8 8 7 7 7 6 6 6 6 6 6 6 6 6 6 6 6 6 6 6 6 6 6 1 1 1 1 1 1 1 1 1 1 1 1 1
symmnumber: 1
zpe: 703279.0 jmol-1
zpe.correction: 0.267865 hartree
zpe.thermalcorrener: 0.286219 hartree
zpe.thermalcorrenthalpy: 0.287163 hartree
zpe.thermalcorrgfe: 0.220181 hartree
zpe.sumelectzpe: -1006.785209 hartree
zpe.sumelectthermal: -1006.766856 hartree
zpe.sumelectthermalent: -1006.765912 hartree
zpe.sumelectthermalfe: -1006.832893 hartree
dipole: 4.7147 -4.8694 0.9277
dipole: 6.8410
quadrupole: -107.3180 -143.4401 -132.0625
quadrupole: 7.7395 -5.2380 2.6065
quadrupole: 20.2889 -15.8333 -4.4556 7.7395 -5.2380 2.6065
hfenergy: -1007.0530743 hartree
pointgroup: C01 [X(C18H13N3O2)]
dipole: 1.9452448 -1.7960479 0.4840157 debye
polarizability: 339.2732565|-2.5308653|254.8953598|-24.8589029|-18.5935891|116.8354532 unknown
InChI: InChI=1S/C18H13N3O2/c1-12-15-16(13-8-4-2-5-9-13)19-21(14-10-6-3-7-11-14)18(22)17(15)20-23-12/h2-11H,1H3
charge 0 multiplicity 1
36 atoms
O  1.783846 3.557519 -0.439585
O  -2.400119 2.411841 -0.589504
N  -1.40096 0.322507 -0.043781
N  -0.286207 -0.522026 0.049183
N  0.32072 3.551813 -0.549702
C  1.174462 1.386257 -0.24892
C  0.954724 -0.037345 -0.061691
C  0.017126 2.236273 -0.417558
C  2.269737 2.259207 -0.246423
C  -1.366404 1.723803 -0.377333
C  2.03931 -1.054919 0.013306
C  -2.661331 -0.391886 0.110621
C  3.746822 2.15456 -0.053439
C  1.925225 -2.144153 0.918208
C  3.166033 -0.99195 -0.849881
C  -3.808602 0.255504 0.632666
C  -2.714191 -1.764484 -0.237689
C  2.925392 -3.136718 0.971651
C  4.163944 -1.989399 -0.797912
C  -5.003879 -0.47795 0.794458
C  -3.915887 -2.483109 -0.0717
C  4.051031 -3.061808 0.116812
C  -5.06795 -1.845263 0.443565
H  4.283133 2.151361 -1.020989
H  4.111235 3.021456 0.523548
H  4.005482 1.228354 0.481172
H  1.047317 -2.197857 1.569607
H  3.242129 -0.186883 -1.589322
H  -3.778256 1.313721 0.893859
H  -1.815475 -2.25243 -0.621281
H  2.829311 -3.967492 1.679159
H  5.021021 -1.935947 -1.478162
H  -5.887708 0.028067 1.197626
H  -3.950598 -3.542417 -0.34888
H  4.82732 -3.833613 0.158509
H  -6.001152 -2.404995 0.568503
