program: Gaussian 09
title: 000032981
version: EM64L-G09RevD.01
frameworkgroup: C1[X(C5H8OS2)]
method: RPBEPBE
basis: SDD
operation: Freq
keyword: #pfreq=noraman
keyword: PBEPBE/SDD
title: #p freq=noraman PBEPBE/SDD
converged: YES YES NO NO
title: Mulliken charges:
elementType: S S O C C C C C H H H H H H H H
charge: 0.075014 0.189487 -0.184811 -0.275899 -0.614603 -0.665022 -0.010667 -0.701542 0.317374 0.280772 0.265765 0.293619 0.276601 0.255092 0.243944 0.254875
chargesum: 0.00000
title: Mulliken charges with hydrogens summed into heavy atoms:
elementType: S S O C C C C C
charge: 0.075014 0.189487 -0.184811 0.041475 -0.068066 -0.094802 -0.010667 0.052369
polarizability: 1.16719271e+02 -2.68034026e+00 8.75563281e+01 8.81202378e+00 2.10396142e+00 6.28833771e+01
1716.lowfreq: -11.6633 -5.9482 -3.6122 -0.0014 0.0017 0.0022 7.4442 46.9148 62.2057
frequency: -3.6294 46.8528 62.1959 87.1570 149.6845 230.1658 301.5881 346.3035 396.8421 463.2458 511.1688 542.7451 578.5235 591.8403 688.5620 867.1522 880.6244 902.5376 972.1401 1009.0896 1026.5524 1062.3130 1100.6546 1109.0074 1170.2165 1225.4468 1271.0011 1355.1539 1377.4715 1404.2956 1446.9699 1448.4588 1453.6121 1630.8619 2995.7906 3016.9810 3087.9906 3095.2071 3108.5031 3118.2901 3142.9112 3205.4103
redmass: 8.0703 1.3314 3.7547 2.4280 9.1785 3.1114 3.2349 2.6092 4.9802 8.0397 3.5753 5.1170 4.1449 8.9952 4.8585 1.7043 1.1326 1.4190 2.4451 1.5364 1.5154 1.1865 1.5847 2.3941 1.8218 1.2968 1.1694 1.5167 1.1873 1.1372 1.1448 1.0481 1.0723 9.8563 1.0357 1.0600 1.0972 1.0541 1.1022 1.1015 1.0912 1.1172
irintensity: 1.3222 4.3172 3.1428 4.2014 1.1057 4.0672 3.2551 8.1469 1.4579 1.5864 0.6418 4.1466 76.5206 6.4893 17.1949 4.8930 2.1188 10.8633 58.8285 5.4851 21.1539 27.5933 2.8283 175.6459 4.6138 3.3761 22.5008 1.4876 39.2428 17.9817 8.6885 17.0494 25.6421 173.2585 1.9268 9.7300 5.6485 12.4473 0.6933 8.0177 1.1609 5.8983
temp: 298.150 k
press: 1.00000 atm
elementType: 16 16 8 6 6 6 6 6 1 1 1 1 1 1 1 1
symmnumber: 1
zpe: 313909.2 jmol-1
zpe.correction: 0.119562 hartree
zpe.thermalcorrener: 0.128629 hartree
zpe.thermalcorrenthalpy: 0.129573 hartree
zpe.thermalcorrgfe: 0.083816 hartree
zpe.sumelectzpe: -1066.028201 hartree
zpe.sumelectthermal: -1066.019134 hartree
zpe.sumelectthermalent: -1066.018190 hartree
zpe.sumelectthermalfe: -1066.063947 hartree
dipole: -1.1315 0.7220 0.6651
dipole: 1.4980
quadrupole: -56.8729 -67.2197 -61.4827
quadrupole: 9.6921 4.6693 1.2725
quadrupole: 4.9855 -5.3612 0.3757 9.6921 4.6693 1.2725
hfenergy: -1066.1477629 hartree
pointgroup: C01 [X(C5H8O1S2)]
dipole: 0.4169441 -0.4033448 0.1039962 debye
dipolederiv: -0.1885646 0.1447556 -0.0342821 0.2433949 -0.3999865 0.0133848 0.0037074 -0.0342821 -0.1789908 -0.6886405 0.1201247 0.2323182 0.1395472 -0.1316704 -0.1297703 0.3694215 -0.0730808 -0.3492387 -0.559262 -0.0942784 0.0028679 0.2483489 -0.7351467 -0.4783689 0.3326554 -0.3529838 -0.6727373 -0.0168828 -0.0604377 0.0288714 -0.4813016 0.2395722 -0.0512907 0.0760973 0.0071724 0.0823817 -0.0794953 -0.1386583 -0.033373 0.0816764 0.1589852 0.0217992 -0.111903 0.0146063 0.104112 0.3677589 0.0854298 0.0500776 0.3354138 0.0037313 0.0123646 0.1689167 -0.0615487 0.0709139 1.2709402 0.0367565 -0.4102377 -0.359633 0.6830139 0.6118302 -0.8706558 0.4742586 0.7790316 -0.4616918 -0.1825235 0.047803 -0.1139404 -0.0419023 -0.0060684 0.1846694 0.0499344 0.004933 0.0185718 0.0452286 0.0677616 0.1048865 0.0510431 0.0079661 0.0294122 0.014829 0.0070348 0.0617429 -0.0188537 -0.050682 -0.0618096 0.0082967 -0.0544928 -0.0819164 -0.0536278 -0.0300382 0.1379749 -0.022003 0.0153892 -0.0857759 -0.0409644 0.0515716 0.0508584 0.0635604 -0.0027841 -0.0215877 0.055924 -0.0312352 -0.0194062 -0.0323421 0.0077028 -0.1253148 -0.027499 0.0775439 -0.0190636 -0.0505626 0.0817094 -0.0591529 0.1052351 0.0003103 0.0051287 0.0237077 0.0008994 -0.017254 0.0599356 -0.0147045 0.0873477 0.0149234 0.0246682 -0.038712 0.0000315 0.1320254 0.1116005 0.0339807 0.047643 -0.0088379 0.0303419 -0.0876145 -0.0108896 -0.1141046 0.0102539 0.0838532 -0.0148183 0.000073 -0.0507578 0.0868695 0.0560078 0.0185247 0.0690266 -0.0353405 unknown
polarizability: 117.7139088|-0.3661451|82.709553|-5.2081575|10.4106164|66.735514 unknown
InChI: InChI=1S/C5H8OS2/c1-4(6)7-2-5-3-8-5/h5H,2-3H2,1H3
charge 0 multiplicity 1
16 atoms
S  -2.780675 1.365432 -0.269125
S  0.739725 0.684542 1.011042
O  1.753722 -0.999427 -0.9072
C  -1.519204 -0.061979 -0.548079
C  -2.95118 -0.506636 -0.643005
C  -0.686101 -0.498322 0.635575
C  1.994487 -0.015012 -0.172968
C  3.309377 0.739884 -0.148619
H  -0.967755 0.043881 -1.488406
H  -3.360078 -0.734013 -1.631887
H  -3.369027 -1.092183 0.182825
H  -0.214441 -1.475501 0.422815
H  -1.28333 -0.550831 1.559599
H  4.136076 0.025364 0.011934
H  3.334981 1.515858 0.632383
H  3.470822 1.214345 -1.133882
