program: Gaussian 09
title: 000032985
version: EM64L-G09RevD.01
frameworkgroup: C1[X(C10H17NO)]
method: RPBEPBE
basis: SDD
operation: Freq
keyword: #p
keyword: freq=noraman
keyword: PBEPBE/SDD
title: #p freq=noraman PBEPBE/SDD
converged: YES YES NO NO
title: Mulliken charges:
elementType: O N C C C C C C C C C C H H H H H H H H H H H H H H H H H
charge: -0.246635 -0.093949 -0.039597 -0.361089 -0.536495 -0.728602 0.373975 -0.615652 -0.622140 -0.438837 -0.261558 -0.183076 0.225563 0.208919 0.191655 0.217121 0.223204 0.253481 0.208345 0.196312 0.186731 0.219400 0.225079 0.229352 0.218678 0.189317 0.256643 0.249243 0.254609
chargesum: 0.00000
title: Mulliken charges with hydrogens summed into heavy atoms:
elementType: O N C C C C C C C C C C
charge: -0.246635 -0.093949 0.185966 0.039486 -0.096170 -0.070463 0.373975 0.015558 0.015207 -0.182194 -0.012315 0.071534
polarizability: 1.27642118e+02 -1.45145825e+01 1.08237943e+02 1.10692874e+00 1.96572271e+00 1.06973187e+02
1716.lowfreq: -14.8847 -0.0009 -0.0006 -0.0004 3.5920 10.6234 14.7174 26.1734 51.2925
frequency: 12.2114 26.1579 51.2028 80.8276 120.8833 165.9394 208.3833 215.2355 233.5034 236.4576 297.7531 324.1567 344.5515 386.3196 395.2864 436.9582 499.2223 593.0285 625.7588 714.9889 721.6527 792.9452 811.6889 844.1614 863.6469 871.1822 873.4915 903.0252 913.8836 941.6201 999.6323 1031.6350 1038.0407 1044.5241 1073.7755 1089.6185 1100.6122 1130.5892 1134.9418 1138.7043 1148.0503 1206.7432 1213.8110 1241.1354 1259.8667 1277.6746 1291.4443 1317.6721 1346.9855 1361.0623 1366.7099 1381.8125 1418.0869 1440.1020 1449.0536 1460.6109 1462.2312 1467.0545 1474.6424 1476.9435 1484.9804 1485.9194 1493.1152 1589.6014 2842.8576 2848.8011 2863.3237 2967.0665 2973.6852 2987.6588 3006.1940 3014.8331 3027.0353 3036.2768 3059.5826 3073.8902 3084.5856 3088.2291 3214.9339 3230.3039 3265.9918
redmass: 2.6287 4.4282 3.8770 2.6532 3.1675 2.4858 1.1281 1.0909 3.3880 1.1441 2.6269 2.1752 3.1625 1.9088 2.7764 2.0503 3.1783 3.1962 3.8317 1.5536 2.5682 2.3772 1.5104 2.4593 3.2323 2.3963 2.1373 1.7899 1.5547 1.7688 1.7376 1.6327 1.9064 2.0808 1.9542 1.3002 1.9525 1.5663 1.6645 1.8202 1.8619 3.1377 1.7196 1.5399 2.5084 1.3057 1.3977 1.4133 1.4417 2.2489 1.4056 1.2381 1.1413 1.1561 1.0906 1.0488 1.0713 1.0533 1.0539 1.0792 1.0535 1.0659 4.8857 6.8889 1.0593 1.0633 1.0601 1.0388 1.0597 1.0844 1.0886 1.0718 1.0726 1.0985 1.0979 1.1009 1.1002 1.0987 1.0921 1.0985 1.1082
irintensity: 0.3424 0.4140 0.0942 0.5720 1.1161 1.6873 0.4309 0.6713 2.1468 0.1685 5.4427 2.4603 4.5384 1.0327 2.7391 0.6356 6.7626 5.7874 0.6961 49.1155 36.9378 8.1503 44.8498 3.0689 15.5220 0.5835 2.7934 1.9108 1.1501 6.6297 20.3103 29.7508 34.8046 9.5706 9.2009 5.6368 10.4467 23.7944 8.7908 5.6942 2.3546 1.0409 0.9038 6.8359 8.0637 1.6011 4.8255 0.4443 0.8548 0.8517 3.5817 23.3506 2.7827 1.2968 6.4151 13.8032 17.8134 1.6962 18.6842 21.8478 13.2855 10.3338 15.4293 16.9127 76.1077 49.5645 217.1135 22.4406 42.4723 6.5848 30.3320 48.4462 39.8843 15.5812 58.7145 38.2538 48.2927 15.9614 6.0065 0.7792 0.8454
temp: 298.150 k
press: 1.00000 atm
elementType: 8 7 6 6 6 6 6 6 6 6 6 6 1 1 1 1 1 1 1 1 1 1 1 1 1 1 1 1 1
symmnumber: 1
zpe: 657878.8 jmol-1
zpe.correction: 0.250573 hartree
zpe.thermalcorrener: 0.264109 hartree
zpe.thermalcorrenthalpy: 0.265053 hartree
zpe.thermalcorrgfe: 0.208168 hartree
zpe.sumelectzpe: -520.239687 hartree
zpe.sumelectthermal: -520.226151 hartree
zpe.sumelectthermalent: -520.225207 hartree
zpe.sumelectthermalfe: -520.282093 hartree
dipole: 0.1933 -0.7916 0.9854
dipole: 1.2787
quadrupole: -74.3756 -72.6269 -70.8922
quadrupole: -1.0135 -0.3255 2.0687
quadrupole: -1.7441 0.0047 1.7394 -1.0135 -0.3255 2.0687
hfenergy: -520.49026 hartree
pointgroup: C01 [X(C10H17N1O1)]
dipole: -0.1019049 0.360772 0.3354981 debye
polarizability: 128.4246227|-13.7584231|106.7520874|1.9158919|-2.6164718|107.6765368 unknown
InChI: InChI=1S/C10H17NO/c1-9(8-11(2)3)7-10-5-4-6-12-10/h4-6,9H,7-8H2,1-3H3
charge 0 multiplicity 1
29 atoms
O  -1.936819 -0.229778 -1.130444
N  2.659213 0.624678 -0.044985
C  0.840505 -1.139568 -0.130624
C  1.418634 0.107324 0.584288
C  -0.548874 -1.517733 0.469636
C  1.815624 -2.33181 -0.040968
C  -1.631275 -0.509923 0.225947
C  3.444308 1.469181 0.878033
C  2.409813 1.312241 -1.328812
C  -2.466762 0.24399 1.036249
C  -3.328376 1.029043 0.171848
C  -2.979426 0.718037 -1.129372
H  0.674995 -0.896987 -1.198653
H  0.629398 0.900861 0.64253
H  1.665859 -0.178129 1.627151
H  -0.453149 -1.663402 1.563206
H  -0.851497 -2.496061 0.044391
H  2.818012 -2.021124 -0.382421
H  1.474152 -3.181352 -0.661718
H  1.906467 -2.68908 1.003949
H  2.909941 2.401875 1.194745
H  4.390175 1.770685 0.392195
H  3.695968 0.894333 1.78729
H  1.91225 0.632338 -2.04077
H  3.372248 1.621489 -1.774666
H  1.767245 2.223478 -1.218193
H  -2.46726 0.240585 2.124758
H  -4.101929 1.729378 0.481191
H  -3.327241 1.037131 -2.107781
