program: Gaussian 09
title: 000032982
version: EM64L-G09RevD.01
frameworkgroup: C1[X(C9H15NO)]
method: RPBEPBE
basis: SDD
operation: Freq
keyword: #p
keyword: freq=noraman
keyword: PBEPBE/SDD
title: #p freq=noraman PBEPBE/SDD
converged: YES YES NO NO
title: Mulliken charges:
elementType: O N C C C C C C C C C H H H H H H H H H H H H H H H
charge: -0.246441 -0.079620 -0.389187 -0.333270 -0.503636 0.375760 -0.614930 -0.625609 -0.439069 -0.259742 -0.182876 0.224685 0.229061 0.171212 0.206701 0.223973 0.212426 0.224084 0.185393 0.221722 0.236442 0.218611 0.184343 0.256156 0.249236 0.254576
chargesum: 0.00000
title: Mulliken charges with hydrogens summed into heavy atoms:
elementType: O N C C C C C C C C C
charge: -0.246441 -0.079620 0.064559 0.044643 -0.067237 0.375760 0.016269 0.013787 -0.182913 -0.010506 0.071700
polarizability: 1.37425535e+02 -4.50287482e+00 9.97215818e+01 8.34813447e+00 4.61314744e+00 7.63086488e+01
1716.lowfreq: -0.0006 -0.0005 -0.0003 4.2755 7.3866 11.7772 29.3307 39.7613 66.0730
frequency: 29.3037 39.7560 66.0671 92.9895 118.4037 174.5540 223.6672 242.7008 263.7093 296.2367 330.1335 362.3137 433.3109 480.7331 593.6095 631.0937 706.4650 717.6441 753.2069 810.5805 820.0433 842.5800 870.2035 871.2011 891.2667 994.8606 1018.4277 1028.5711 1033.4874 1043.0452 1065.2923 1077.9833 1092.7484 1121.9559 1131.3824 1151.4969 1207.2979 1215.3128 1222.3831 1259.0435 1271.4193 1290.3847 1301.5998 1336.2007 1362.6389 1377.6501 1418.2339 1442.2522 1455.2359 1459.9658 1461.8148 1474.2285 1477.8878 1482.2041 1488.2611 1494.0595 1593.2486 2808.7322 2839.4388 2855.7015 2969.7798 2997.3004 3005.9561 3016.1220 3030.2312 3036.4494 3073.7065 3076.0273 3088.8329 3215.4268 3230.7917 3266.2492
redmass: 3.0300 3.7630 4.0320 2.2986 1.9897 3.3335 1.2443 1.1834 2.6275 2.6934 2.2683 2.8697 2.2646 3.0937 3.1664 4.0319 3.4172 1.3718 1.1554 1.2958 4.1532 1.5507 1.4983 4.4891 2.8992 1.7773 2.6048 2.7985 1.7968 1.8168 2.1755 1.9907 1.4328 1.3507 1.5216 1.7246 2.7270 1.7061 1.6709 1.8796 1.6825 1.2324 1.2215 1.4786 2.3130 1.4052 1.1444 1.1631 1.0894 1.0585 1.0639 1.0668 1.0512 1.0822 1.0774 4.8893 6.9441 1.0702 1.0576 1.0576 1.0634 1.0835 1.0616 1.0716 1.0718 1.0961 1.1034 1.1018 1.1001 1.0920 1.0988 1.1082
irintensity: 0.7561 0.8131 0.3786 0.1461 0.5712 0.3139 0.7735 0.0664 1.2129 10.3167 8.2880 2.1103 0.0525 8.1595 5.1463 2.1225 8.7797 78.9937 3.0491 39.4231 15.4771 8.0401 0.5508 1.0760 10.3249 29.9637 18.2512 2.5254 17.8811 3.0527 8.8681 9.6831 6.5295 19.2927 18.1160 12.1229 2.4563 0.3383 13.5522 3.2660 5.4746 3.9782 6.5765 2.2681 2.0778 12.6845 2.2090 2.7223 5.1120 9.1949 17.7514 5.0213 13.0180 6.7633 23.3418 16.7424 22.8143 82.4736 73.2611 232.4694 24.2626 20.3839 31.5155 47.0423 46.2470 4.1695 17.9478 64.2911 41.5517 6.1460 0.8288 0.8798
temp: 298.150 k
press: 1.00000 atm
elementType: 8 7 6 6 6 6 6 6 6 6 6 1 1 1 1 1 1 1 1 1 1 1 1 1 1 1
symmnumber: 1
zpe: 586308.3 jmol-1
zpe.correction: 0.223313 hartree
zpe.thermalcorrener: 0.235401 hartree
zpe.thermalcorrenthalpy: 0.236345 hartree
zpe.thermalcorrgfe: 0.183557 hartree
zpe.sumelectzpe: -481.014365 hartree
zpe.sumelectthermal: -481.002277 hartree
zpe.sumelectthermalent: -481.001333 hartree
zpe.sumelectthermalfe: -481.054121 hartree
dipole: 0.3202 -0.5495 0.4448
dipole: 0.7760
quadrupole: -60.6119 -63.3414 -71.4603
quadrupole: -0.3963 4.5115 0.4339
quadrupole: 4.5260 1.7964 -6.3224 -0.3963 4.5115 0.4339
hfenergy: -481.2376776 hartree
pointgroup: C01 [X(C9H15N1O1)]
dipole: 0.1273724 0.2227606 -0.1654461 debye
dipolederiv: -0.5132161 0.0777805 0.1866933 0.0250711 -0.4455611 -0.1446264 0.1620313 -0.1774154 -0.2622945 -0.7216196 0.0065491 0.0434912 0.0232648 -0.5070693 -0.0170337 -0.0332328 -0.0103878 -0.5719123 -0.0916541 -0.0080851 0.0140961 -0.1020964 0.0686803 0.0346993 0.0580889 0.0764656 0.0736967 0.4546682 -0.1533478 0.1004217 -0.1137393 0.2037155 -0.0055394 0.0769309 -0.0064516 0.4788188 -0.0650686 -0.0311179 0.0044345 0.0701253 0.1246929 -0.0096825 0.0403348 0.0118617 0.1788096 0.4248545 0.030397 -0.1407774 0.080048 0.269363 0.1490098 -0.2199289 0.1414024 0.065952 0.405067 0.1317501 -0.1079384 0.2163154 0.1528369 0.0007146 -0.1232838 -0.0018537 0.3629489 0.0513588 -0.0370528 -0.0512241 -0.0771898 0.3953342 0.0997334 -0.0877012 0.1000572 0.3618261 -0.2556493 0.0387164 0.0015931 0.0684761 -0.0446996 0.0481618 0.0396528 0.0658321 -0.201195 -0.0207948 0.0632808 -0.0665774 0.0922353 -0.0609819 0.0162582 -0.0297043 0.0396472 -0.1777127 0.169581 -0.0406028 -0.1759034 -0.1464326 0.0407052 0.135785 -0.2018384 0.1024842 -0.0341305 0.067039 0.0108675 0.0049082 0.0028574 0.065999 -0.0065521 0.0193747 -0.0017553 -0.1409007 0.087951 -0.023374 -0.0101775 -0.0267902 -0.1248247 -0.0169628 0.0130493 -0.0422583 0.059049 -0.0727976 0.0347868 0.0275347 0.0105378 0.0350336 -0.0627262 -0.0880585 0.04618 -0.3072875 0.0464897 -0.0094607 -0.0115703 -0.005026 -0.1895853 -0.008363 -0.0205885 -0.0354466 0.048751 0.0335399 -0.0083732 -0.0007902 -0.0045058 -0.1237605 -0.0288001 -0.0132219 -0.0751098 0.0739932 0.0065344 -0.0270982 0.057025 -0.0145009 0.0761999 -0.0146372 0.051619 0.032327 -0.145533 0.0943084 0.0365311 0.0261263 -0.0474366 -0.1772877 -0.061857 0.0357274 -0.0505621 0.0745247 -0.0789732 -0.0610013 0.0441384 -0.0361771 0.0455867 -0.0469332 0.2432149 0.0405855 -0.2584182 -0.1213588 0.0414835 -0.0847623 0.1211437 0.0595193 0.0793262 -0.1110775 0.0653782 0.0047009 -0.0578452 -0.1520521 0.0770524 -0.1223695 0.0183389 0.01191 0.0825615 -0.0022299 0.0589296 -0.0931776 0.1414176 -0.1090965 0.0716135 0.0360171 0.0268939 -0.1107815 0.0460389 0.0177155 0.0653306 0.0305013 0.0372711 0.0166885 -0.0659383 -0.0139859 0.0777843 -0.1993165 -0.2546209 0.136215 -0.0377838 0.0136037 -0.0303159 -0.0168082 -0.0792085 0.0132434 -0.0764924 0.1549751 -0.0337007 -0.0109654 0.0860206 -0.0061269 0.1378056 -0.0265237 0.0955311 -0.0233682 0.1555182 0.0829179 -0.0437466 0.0344072 -0.0656699 0.0266887 -0.0590604 0.030273 -0.0656121 0.1837962 unknown
polarizability: 137.4206503|4.5007724|99.1299259|-8.4645832|5.7567511|76.905189 unknown
InChI: InChI=1S/C9H15NO/c1-10(2)7-3-5-9-6-4-8-11-9/h4,6,8H,3,5,7H2,1-2H3
charge 0 multiplicity 1
26 atoms
O  -2.122875 -0.844306 -0.58373
N  3.258236 -0.125144 0.345974
C  0.748704 0.075164 0.116847
C  2.138831 0.532906 -0.368779
C  -0.38099 0.920254 -0.53404
C  -1.759989 0.461981 -0.170521
C  4.549104 0.53859 0.070293
C  3.332889 -1.580277 0.102177
C  -2.82765 1.0304 0.507153
C  -3.904012 0.056942 0.526549
C  -3.442704 -1.06254 -0.140804
H  0.704724 0.168809 1.217876
H  0.575511 -0.987844 -0.131032
H  2.20874 0.375615 -1.480311
H  2.233651 1.623682 -0.19567
H  -0.282116 1.978292 -0.227093
H  -0.257491 0.893856 -1.636618
H  4.48402 1.607571 0.34215
H  4.864996 0.473771 -1.003282
H  5.342951 0.077802 0.685395
H  2.4104 -2.076929 0.445956
H  4.176128 -2.00439 0.676051
H  3.484719 -1.837407 -0.978549
H  -2.844741 2.027718 0.942852
H  -4.886996 0.178121 0.977739
H  -3.867042 -2.032335 -0.384582
