program: Gaussian 09
title: 000033071
version: EM64L-G09RevD.01
frameworkgroup: C1[X(C19H20N2O)]
method: RPBEPBE
basis: SDD
operation: Freq
keyword: #p
keyword: freq=noraman
keyword: PBEPBE/SDD
title: #p freq=noraman PBEPBE/SDD
converged: YES YES NO NO
title: Mulliken charges:
elementType: O N N C C C C C C C C C C C C C C C C C C C H H H H H H H H H H H H H H H H H H H H
charge: -0.255697 -0.090391 0.016325 -0.403056 -0.389326 -0.380271 -0.375753 -0.361553 -0.373385 0.071631 0.275006 0.362463 0.336200 -0.331587 -0.371386 -0.412091 -0.406293 -0.393704 -0.393762 -0.236383 -0.236572 -0.241238 0.199136 0.226231 0.213046 0.209527 0.207126 0.210809 0.230234 0.226941 0.211128 0.241572 0.223461 0.283588 0.276658 0.233892 0.237830 0.240615 0.238952 0.225831 0.224920 0.229326
chargesum: 0.00000
title: Mulliken charges with hydrogens summed into heavy atoms:
elementType: O N N C C C C C C C C C C C C C C C C C C C
charge: -0.255697 -0.090391 0.016325 0.022311 0.033247 0.037663 0.081422 0.091147 -0.149924 0.071631 0.275006 0.362463 0.336200 -0.047999 -0.094728 -0.178199 -0.168462 -0.153089 -0.154810 -0.010552 -0.011653 -0.011912
polarizability: 4.08628632e+02 -8.40562122e+00 2.42266001e+02 6.33142414e+00 9.56429832e+00 1.21641295e+02
1716.lowfreq: -16.6268 -6.9868 -3.7325 -0.0007 0.0002 0.0004 4.9497 20.1500 35.1444
frequency: -10.0547 17.9279 34.9714 54.3555 58.2096 70.1878 98.9829 140.9147 151.6201 178.6060 198.0577 214.8308 242.7446 265.9115 297.6116 321.2539 348.7383 373.8804 395.8824 404.2985 409.3732 439.1326 447.8591 466.3300 482.8557 533.4246 547.2257 595.2215 613.9151 631.3783 643.0272 681.9189 699.0133 701.1530 750.2596 755.4601 778.6491 783.5896 800.2873 849.5384 849.8164 852.5293 859.4170 867.1657 895.1931 918.1813 921.3617 947.3867 973.6435 987.4043 991.2142 993.4349 994.4459 996.7492 1002.0006 1015.5827 1038.7384 1047.5975 1080.7193 1084.6234 1089.3260 1106.4499 1118.2753 1122.4126 1152.0637 1171.9764 1173.2941 1189.9715 1202.0230 1242.9955 1258.6042 1268.1830 1288.5592 1295.2197 1303.4262 1305.0790 1312.4867 1331.4005 1341.5785 1347.9012 1352.0693 1355.0829 1362.7797 1375.6237 1377.7861 1415.9913 1436.8618 1456.8158 1462.4747 1465.2642 1467.5235 1474.2800 1477.3142 1499.0544 1511.0076 1534.1405 1564.8203 1586.9086 1611.6951 1616.5932 2925.9189 2930.1335 2975.4871 2991.9937 2992.4169 3045.5952 3048.5483 3054.0499 3060.1929 3063.8000 3081.6603 3122.5344 3127.0711 3132.3202 3133.0385 3141.4392 3149.5152 3159.3612 3164.9179 3180.3478
redmass: 3.1996 3.6882 4.4649 3.9871 6.1797 3.7616 5.2517 4.2655 4.9991 4.2648 2.0923 4.5825 2.9997 6.6444 4.5876 3.4332 1.8191 4.3174 4.3473 2.8546 2.8999 3.1065 3.9835 4.7904 3.5261 2.8792 3.0233 3.8196 6.5242 5.8929 5.5249 3.5800 4.5039 1.7841 2.3687 4.7570 3.0214 2.7355 1.7702 1.3331 1.3539 2.5301 1.2605 1.5690 1.6601 2.3475 1.4731 1.3125 1.4355 4.6090 2.3753 1.3245 1.5770 5.3226 1.3911 3.0828 1.9679 1.9527 2.6998 1.6275 1.4334 2.1901 1.3907 2.3149 1.3395 2.1803 1.0526 1.1285 1.1675 2.0539 1.2940 1.2685 2.7017 1.6386 1.3926 2.0462 1.4369 1.2831 1.4184 1.4442 1.6175 2.5854 1.6480 7.5368 2.0028 4.2210 2.3919 1.0907 1.0960 1.0852 1.0882 2.1573 1.0989 7.8198 2.8631 5.2716 6.2726 6.4085 6.0205 6.3086 1.0698 1.0698 1.0643 1.0617 1.0611 1.0964 1.0927 1.0999 1.0954 1.0950 1.0922 1.0844 1.0878 1.0881 1.0894 1.0917 1.0963 1.0952 1.1016 1.0942
irintensity: 0.0432 0.9441 0.7734 0.6273 0.6731 0.0640 1.1466 1.2025 0.9854 0.9269 2.1360 5.5842 10.7825 0.7978 0.4226 5.1386 6.0995 30.1758 0.6621 0.6976 0.1036 0.1892 3.9434 3.6308 10.1214 2.0257 3.7588 0.6830 0.4859 11.5748 4.2444 4.9553 44.4367 50.4854 59.1925 9.7060 26.1683 19.0253 17.7501 23.2962 28.1262 0.0664 2.9095 62.0590 19.7189 8.4195 1.9671 4.7058 0.6535 0.1578 58.9077 0.4934 13.4910 9.7692 0.6656 2.2148 8.3408 4.2904 85.4508 4.7062 29.7739 64.5023 16.1000 6.8446 15.2370 115.4467 0.0386 1.1154 28.6829 1.2143 24.6619 15.9304 12.2395 11.6066 19.9635 443.2299 12.0898 13.7189 2.6555 4.3181 18.1392 1.5899 22.1565 4.5369 40.9124 15.1165 10.8619 7.8109 47.6296 24.3673 19.0445 11.4648 6.0873 150.1420 7.5344 286.1279 79.4783 1.8156 0.6412 63.0951 24.9624 83.8326 40.7627 31.0676 29.2827 74.9900 10.0005 31.9730 58.8175 56.1248 19.5097 7.1299 4.1912 5.9982 11.9794 12.7128 40.3015 7.5216 32.4931 12.3053
temp: 298.150 k
press: 1.00000 atm
elementType: 8 7 7 6 6 6 6 6 6 6 6 6 6 6 6 6 6 6 6 6 6 6 1 1 1 1 1 1 1 1 1 1 1 1 1 1 1 1 1 1 1 1
symmnumber: 1
zpe: 904983.7 jmol-1
zpe.correction: 0.344690 hartree
zpe.thermalcorrener: 0.363018 hartree
zpe.thermalcorrenthalpy: 0.363962 hartree
zpe.thermalcorrgfe: 0.296459 hartree
zpe.sumelectzpe: -919.144983 hartree
zpe.sumelectthermal: -919.126655 hartree
zpe.sumelectthermalent: -919.125711 hartree
zpe.sumelectthermalfe: -919.193214 hartree
dipole: -3.9232 -4.8397 0.6613
dipole: 6.2651
quadrupole: -85.7445 -135.7790 -132.3944
quadrupole: 7.1135 0.1943 4.0756
quadrupole: 32.2282 -17.8064 -14.4218 7.1135 0.1943 4.0756
hfenergy: -919.4896728 hartree
pointgroup: C01 [X(C19H20N2O1)]
dipole: -1.5777136 -1.567118 -1.0632694 debye
polarizability: 406.6645951|5.1103886|169.1124588|-23.0376199|59.4489105|196.7588742 unknown
InChI: InChI=1S/C19H20N2O/c22-19(15-20-21-13-5-2-6-14-21)18-11-9-17(10-12-18)16-7-3-1-4-8-16/h1,3-4,7-12,15H,2,5-6,13-14H2
charge 0 multiplicity 1
42 atoms
O  -1.134577 2.378298 2.623839
N  -3.975199 -0.580552 0.337279
N  -2.723142 -0.12971 0.618297
C  -6.534796 -1.765463 -0.414648
C  -6.455124 -0.322756 0.130258
C  -5.243885 -2.09698 -1.196408
C  -5.207332 -0.104295 1.015727
C  -4.008016 -1.920917 -0.294115
C  -2.506249 0.888292 1.445701
C  -1.166856 1.435382 1.753643
C  0.120637 0.959699 1.133408
C  2.680776 0.201447 0.069782
C  4.006987 -0.195845 -0.481404
C  0.219087 -0.001734 0.09017
C  1.323168 1.535102 1.63215
C  1.476331 -0.367833 -0.428142
C  2.574655 1.163826 1.114543
C  5.163097 -0.23056 0.347595
C  4.155125 -0.552269 -1.851234
C  6.419306 -0.608122 -0.172029
C  5.410726 -0.929589 -2.372573
C  6.550691 -0.959863 -1.535695
H  -6.654081 -2.479264 0.426374
H  -7.422723 -1.879488 -1.063234
H  -6.419661 0.385917 -0.719565
H  -7.353133 -0.075236 0.726913
H  -5.265077 -3.13708 -1.571798
H  -5.159305 -1.427336 -2.07412
H  -5.100412 0.972636 1.231838
H  -5.323582 -0.631096 1.989899
H  -4.017472 -2.701391 0.500025
H  -3.067237 -2.029123 -0.857407
H  -3.29819 1.412678 2.004735
H  -0.693333 -0.461671 -0.294032
H  1.238133 2.285272 2.425308
H  1.527619 -1.133644 -1.210628
H  3.480272 1.646559 1.498978
H  5.070299 0.009445 1.412714
H  3.287203 -0.502317 -2.518524
H  7.293583 -0.636492 0.488087
H  5.502286 -1.190336 -3.43305
H  7.526102 -1.252391 -1.939958
