program: Gaussian 09
title: 000033002
version: EM64L-G09RevD.01
frameworkgroup: C1[X(C13H26O2)]
method: RPBEPBE
basis: SDD
operation: Freq
keyword: #pfreq=noraman
keyword: PBEPBE/SDD
title: #p freq=noraman PBEPBE/SDD
converged: YES YES NO NO
title: Mulliken charges:
elementType: O O C C C C C C C C C C C C C H H H H H H H H H H H H H H H H H H H H H H H H H H
charge: -0.418221 -0.231172 -0.381365 -0.386837 -0.394335 -0.383770 -0.374245 -0.020995 -0.385121 -0.368818 -0.376158 -0.715049 -0.716501 -0.488041 0.170914 0.190412 0.193613 0.194177 0.193742 0.202937 0.188156 0.193591 0.192658 0.188133 0.187740 0.196566 0.196112 0.191010 0.191198 0.191345 0.216007 0.219714 0.202884 0.221047 0.210277 0.205649 0.212355 0.211277 0.252401 0.251798 0.374913
chargesum: 0.00000
title: Mulliken charges with hydrogens summed into heavy atoms:
elementType: O O C C C C C C C C C C C C C
charge: -0.043307 -0.231172 0.002660 0.001083 -0.003242 0.002479 0.001627 0.170016 0.007557 0.013725 0.059563 -0.080841 -0.087219 0.016158 0.170914
polarizability: 1.96051043e+02 2.19062707e-01 1.34085507e+02 -2.69417776e-01 -2.69209365e+00 1.16214127e+02
1716.lowfreq: -13.7444 -0.0006 0.0008 0.0012 3.1254 10.4556 12.3144 19.6643 31.1818
frequency: -1.0432 19.0384 30.7903 45.5123 51.4392 77.7052 80.0165 87.6599 119.5109 124.0317 137.3041 153.2676 154.3899 160.0385 203.8506 223.1894 236.9140 294.1399 310.5634 382.4190 385.8389 424.5835 453.4118 487.8041 500.2517 509.0666 589.0293 639.6720 721.3405 724.1635 733.2762 758.9307 800.7897 818.8713 857.0039 864.6015 912.9380 923.2094 942.5152 954.3324 986.1035 992.0540 1004.9821 1019.8525 1037.5645 1050.4402 1057.7818 1076.6422 1081.7875 1083.7182 1099.1888 1117.4614 1138.3343 1177.4424 1179.0563 1202.9468 1209.0886 1233.2875 1234.1982 1252.5935 1261.3289 1276.8374 1280.2809 1283.8672 1289.6270 1296.3961 1296.6978 1301.4229 1321.7830 1330.3171 1341.7549 1355.2896 1358.6872 1362.8361 1375.4579 1376.8190 1394.1591 1437.5096 1455.0373 1461.1876 1461.8964 1465.1250 1467.9771 1468.2397 1472.2109 1476.3582 1482.1290 1483.5860 1487.8697 1489.2416 1669.4646 2943.9459 2949.2220 2949.5239 2951.5710 2952.0627 2954.7278 2960.5671 2964.4697 2965.1542 2969.1335 2982.4880 2985.4540 2987.2185 2992.2249 2995.2418 2999.5841 3014.3284 3027.5460 3032.8075 3041.0548 3055.9449 3061.3673 3063.4045 3066.4521 3073.7605 3510.3797
redmass: 4.1629 4.8331 4.6883 2.9820 2.1842 3.4620 2.2190 2.1594 1.8557 2.2260 4.2836 1.9247 2.1088 3.9199 1.1380 2.5198 1.2489 3.4740 3.3787 2.5174 2.7463 2.3801 3.2840 2.8246 1.8988 2.9620 4.6153 1.3134 1.0624 1.0823 1.1344 1.2235 1.5103 1.9826 4.8630 1.3250 1.1782 1.4328 1.6176 1.5167 4.8279 1.4690 2.8507 3.6440 1.2276 2.9760 2.5637 2.5978 2.1422 2.2121 2.9164 1.4471 2.5153 1.7457 1.9453 1.5679 1.2984 1.4042 1.3512 1.3933 1.2892 1.3355 1.0833 1.1252 1.0712 1.1292 1.1110 1.3404 1.4475 1.4224 1.5095 1.5827 1.6430 1.6304 1.8105 1.2233 1.2142 1.0849 1.0737 1.0733 1.0769 1.0639 1.0486 1.0855 1.0603 1.0960 1.0607 1.0912 1.0750 1.0771 8.2125 1.0620 1.0591 1.0593 1.0623 1.0711 1.0640 1.0611 1.0406 1.0542 1.0366 1.0959 1.0621 1.0964 1.0988 1.0601 1.1022 1.1039 1.1017 1.1019 1.1043 1.0992 1.1030 1.0989 1.0994 1.0985 1.0639
irintensity: 0.7038 0.0786 0.1499 0.0242 0.0303 0.4243 0.2538 0.0042 0.0789 0.0169 0.8319 0.0444 0.0253 0.1023 0.0465 0.9619 0.0998 2.3694 0.4664 3.1387 2.3356 0.3892 9.3489 0.4858 25.4523 21.6832 14.0407 129.2454 16.2279 4.7010 5.8887 1.1617 3.6499 0.6312 1.4360 2.3868 3.9195 3.3923 1.4552 0.7877 31.7633 0.8251 0.0545 146.3274 0.5911 36.3887 67.1302 0.9540 1.2128 5.4019 15.3302 0.9501 7.1444 16.7063 1.0233 3.9805 26.2779 0.9014 0.0167 2.4210 0.4418 10.9878 0.0331 0.7161 0.7388 0.0840 1.8799 12.8773 5.1922 2.6632 19.4394 3.2942 1.8272 2.2031 28.8863 18.7069 15.2429 27.6067 0.5251 0.2361 0.0584 0.0960 1.6940 0.8022 3.7403 4.2132 5.1006 3.0724 6.3394 46.6662 208.3957 8.2801 1.2580 0.4004 3.5856 11.8100 4.8394 2.6824 27.4575 237.4315 30.0087 1.4644 5.1979 1.3476 8.3355 40.4548 0.8394 8.3196 0.5851 2.8215 196.5091 7.2575 83.0563 105.8562 59.8592 57.2750 17.5985
temp: 298.150 k
press: 1.00000 atm
elementType: 8 8 6 6 6 6 6 6 6 6 6 6 6 6 6 1 1 1 1 1 1 1 1 1 1 1 1 1 1 1 1 1 1 1 1 1 1 1 1 1 1
symmnumber: 1
zpe: 962150.3 jmol-1
zpe.correction: 0.366464 hartree
zpe.thermalcorrener: 0.385227 hartree
zpe.thermalcorrenthalpy: 0.386171 hartree
zpe.thermalcorrgfe: 0.316892 hartree
zpe.sumelectzpe: -660.196325 hartree
zpe.sumelectthermal: -660.177561 hartree
zpe.sumelectthermalent: -660.176617 hartree
zpe.sumelectthermalfe: -660.245897 hartree
dipole: 0.4535 -1.4188 0.3095
dipole: 1.5214
quadrupole: -96.0915 -102.0012 -94.3408
quadrupole: 8.0898 -2.6110 1.8562
quadrupole: 1.3864 -4.5234 3.1370 8.0898 -2.6110 1.8562
hfenergy: -660.5627883 hartree
pointgroup: C01 [X(C13H26O2)]
dipole: 0.1814229 0.5619019 -0.0981123 debye
polarizability: 196.047127|-0.5835053|134.2877023|0.092877|-1.9177771|116.0158476 unknown
InChI: InChI=1S/C13H26O2/c1-12(2)10-8-6-4-3-5-7-9-11-13(14)15/h12,14H,3-11H2,1-2H3
charge 0 multiplicity 1
41 atoms
O  -7.58575 0.677735 -0.141634
O  -6.587722 -1.374248 0.282919
C  2.544166 0.535602 -0.086842
C  1.243459 -0.269655 0.130098
C  3.826819 -0.29043 0.161226
C  -0.037312 0.556103 -0.125707
C  5.121095 0.532675 -0.029857
C  6.435612 -0.231545 0.284467
C  -1.338517 -0.243921 0.106239
C  -2.618119 0.583257 -0.149979
C  -3.913416 -0.224141 0.083836
C  6.685581 -1.393738 -0.707578
C  7.639387 0.740979 0.291282
C  -5.177601 0.619526 -0.165971
C  -6.465217 -0.157818 0.021842
H  2.542954 1.420013 0.584815
H  2.560487 0.934332 -1.123038
H  1.245995 -1.157651 -0.536506
H  1.22528 -0.662113 1.168536
H  3.828321 -1.165156 -0.520295
H  3.804623 -0.699062 1.19373
H  -0.023029 0.939952 -1.16749
H  -0.033989 1.449497 0.533861
H  5.068343 1.429344 0.623382
H  5.167771 0.911447 -1.073508
H  -1.342086 -1.1376 -0.552272
H  -1.352353 -0.626815 1.148054
H  6.337968 -0.664874 1.303655
H  -2.61232 1.476817 0.509498
H  -2.602308 0.96606 -1.192296
H  -3.930694 -0.614553 1.119683
H  -3.928709 -1.112318 -0.576506
H  6.761349 -1.008478 -1.743477
H  5.871742 -2.140582 -0.681988
H  7.630625 -1.918778 -0.473401
H  7.765789 1.212495 -0.702875
H  7.498236 1.549936 1.032669
H  8.580777 0.214245 0.5361
H  -5.21157 1.500823 0.504105
H  -5.1819 1.031228 -1.195208
H  -8.413267 0.13721 -0.019267
