program: Gaussian 09
title: 000033027
version: EM64L-G09RevD.01
frameworkgroup: C1[X(C13H11N3O2)]
method: RPBEPBE
basis: SDD
operation: Freq
keyword: #p
keyword: freq=noraman
keyword: PBEPBE/SDD
title: #p freq=noraman PBEPBE/SDD
converged: YES YES NO NO
title: Mulliken charges:
elementType: O O N N N C C C C C C C C C C C C C H H H H H H H H H H H
charge: -0.198891 -0.235313 -0.225732 -0.016238 0.012790 0.010809 0.003390 -0.051400 0.249848 0.352827 0.189816 -0.776848 -0.382086 -0.378864 -0.592771 -0.239313 -0.229740 -0.238787 0.261993 0.251662 0.270707 0.241183 0.258753 0.248182 0.243188 0.270523 0.233618 0.232362 0.234329
chargesum: 0.00000
title: Mulliken charges with hydrogens summed into heavy atoms:
elementType: O O N N N C C C C C C C C C C C C C
charge: -0.198891 -0.235313 -0.225732 -0.016238 0.012790 0.010809 0.003390 -0.051400 0.249848 0.352827 0.189816 0.007515 -0.140903 -0.120111 0.169123 -0.005695 0.002622 -0.004458
polarizability: 2.51096134e+02 1.15358243e+01 1.81939173e+02 -1.94503558e+00 1.26272724e+01 9.09823278e+01
1716.lowfreq: -8.6974 -2.0919 -0.0010 -0.0006 0.0004 3.8642 47.7029 57.3183 77.6495
frequency: 47.6780 57.3144 77.6364 82.5225 105.0938 110.6599 131.8727 211.7868 220.6637 248.3726 259.5485 287.2650 307.8417 346.7459 358.1337 404.9242 408.0097 446.2810 494.5261 496.3506 579.7726 603.4420 617.5134 620.9819 659.2034 669.5518 689.9140 705.2916 730.3094 767.8035 781.2760 805.0998 856.8779 876.1863 928.2492 931.1938 973.6071 980.5679 989.6796 999.1518 1000.4062 1031.8113 1040.7260 1054.3943 1083.1579 1126.1252 1153.2056 1174.4651 1189.2105 1194.5286 1236.6315 1260.4133 1315.9800 1340.1773 1377.8313 1404.2887 1407.1777 1415.3519 1426.8111 1437.1191 1454.7649 1461.3739 1472.5289 1478.8984 1482.7883 1494.7095 1582.1137 1592.2714 1611.5436 1617.2402 2992.4233 3011.2576 3076.6405 3103.9605 3122.8160 3127.6750 3135.8751 3143.6272 3147.8690 3159.1733 3170.8867
redmass: 4.5293 4.2788 1.3406 2.3744 5.7118 2.2351 1.3165 3.9667 4.1637 6.4627 5.6163 5.2233 4.5881 4.8658 5.5892 5.3802 3.1395 5.2880 8.7030 4.0096 9.5123 6.4434 6.7800 7.0998 6.5088 5.5176 8.0518 1.7991 7.4808 3.2564 3.2979 10.2839 1.2508 7.0041 1.4302 2.7531 3.3336 1.4084 5.3943 1.3660 4.1292 2.0607 1.4852 5.4796 1.5941 1.3072 3.0836 1.0546 1.1172 3.5471 5.8442 4.0669 1.3747 6.0912 7.4665 1.2665 5.1765 1.4148 3.4631 2.8349 1.0879 1.1708 1.1447 1.0644 2.4502 3.5495 6.4854 8.2622 6.3457 10.6152 1.0403 1.0334 1.0941 1.1027 1.0988 1.0854 1.0880 1.1010 1.0932 1.0961 1.1007
irintensity: 3.1712 1.0943 0.0585 0.5386 0.2165 1.1559 0.3173 0.4917 1.2190 3.4936 1.7646 2.8454 2.5420 8.4343 1.5648 0.4461 0.2676 15.1047 6.3210 7.8651 1.9025 1.6429 2.9285 2.9788 14.2529 8.8526 17.6006 49.4608 2.0896 24.7908 29.8397 8.3632 1.1719 1.4418 4.4441 12.4800 17.4266 1.7886 0.4120 3.3001 65.9101 3.5914 5.2421 38.6678 7.8735 0.4162 62.3668 0.0125 0.6590 16.7058 22.5803 54.5880 2.7379 32.2985 0.1104 4.0417 11.5414 17.3014 82.1039 42.8391 13.1415 35.5598 26.7146 21.5128 12.5602 0.8111 10.5699 17.6298 31.8279 306.7158 7.7439 36.1643 6.2448 18.1650 4.7788 2.1745 2.1347 0.2667 24.9663 22.0760 15.5325
temp: 298.150 k
press: 1.00000 atm
elementType: 8 8 7 7 7 6 6 6 6 6 6 6 6 6 6 6 6 6 1 1 1 1 1 1 1 1 1 1 1
symmnumber: 1
zpe: 568101.5 jmol-1
zpe.correction: 0.216378 hartree
zpe.thermalcorrener: 0.231684 hartree
zpe.thermalcorrenthalpy: 0.232628 hartree
zpe.thermalcorrgfe: 0.173327 hartree
zpe.sumelectzpe: -815.367053 hartree
zpe.sumelectthermal: -815.351747 hartree
zpe.sumelectthermalent: -815.350803 hartree
zpe.sumelectthermalfe: -815.410104 hartree
dipole: 6.7543 -0.3972 -0.5348
dipole: 6.7870
quadrupole: -118.7919 -94.9897 -102.0615
quadrupole: 11.2749 1.0732 3.5999
quadrupole: -13.5109 10.2914 3.2195 11.2749 1.0732 3.5999
hfenergy: -815.5834315 hartree
pointgroup: C01 [X(C13H11N3O2)]
dipole: -2.650029 -0.068787 0.3205258 debye
polarizability: 250.6934141|-13.6036535|171.1942999|-3.9515374|-31.8981424|102.1299207 unknown
InChI: InChI=1S/C13H11N3O2/c1-8-10-11(9-6-4-3-5-7-9)14-16(2)13(17)12(10)15-18-8/h3-7H,1-2H3
charge 0 multiplicity 1
29 atoms
O  1.70269 2.74826 -0.585157
O  4.020447 -0.938219 -0.189113
N  1.838844 -1.710784 0.255413
N  0.45181 -1.595452 0.309359
N  2.78508 1.758089 -0.543827
C  0.682328 0.757615 -0.225028
C  -0.131732 -0.413527 0.060866
C  2.119779 0.599009 -0.317416
C  0.462986 2.133554 -0.378063
C  -1.620017 -0.419684 0.086365
C  2.783331 -0.701582 -0.103033
C  -0.705041 3.063452 -0.33351
C  -2.371998 0.286198 -0.891061
C  -2.310333 -1.191214 1.058992
C  2.323446 -3.074127 0.55068
C  -3.782732 0.234774 -0.884821
C  -3.719754 -1.238121 1.066276
C  -4.462509 -0.521961 0.09745
H  -0.405419 4.016948 0.133696
H  -1.07929 3.294309 -1.348513
H  -1.53366 2.622755 0.240846
H  -1.853663 0.841103 -1.681018
H  -1.728307 -1.749599 1.798729
H  1.894549 -3.786246 -0.173332
H  2.014114 -3.364288 1.568107
H  3.419812 -3.069717 0.472402
H  -4.349509 0.773301 -1.652282
H  -4.239817 -1.831234 1.826457
H  -5.557335 -0.559314 0.103735
