program: Gaussian 09
title: 000032986
version: EM64L-G09RevD.01
frameworkgroup: C1[X(C11H19NO)]
method: RPBEPBE
basis: SDD
operation: Freq
keyword: #p
keyword: freq=noraman
keyword: PBEPBE/SDD
title: #p freq=noraman PBEPBE/SDD
converged: YES YES NO NO
title: Mulliken charges:
elementType: O N C C C C C C C C C C C H H H H H H H H H H H H H H H H H H H
charge: -0.247079 -0.089039 -0.030852 -0.405258 -0.568462 -0.380446 0.374008 -0.730157 -0.613034 -0.626777 -0.444481 -0.262469 -0.185353 0.234263 0.211059 0.201616 0.228857 0.223170 0.189023 0.229375 0.226809 0.220136 0.215622 0.222446 0.187303 0.220046 0.231643 0.216659 0.191329 0.256470 0.249034 0.254540
chargesum: 0.00000
title: Mulliken charges with hydrogens summed into heavy atoms:
elementType: O N C C C C C C C C C C C
charge: -0.247079 -0.089039 0.203411 0.007417 -0.116435 0.037952 0.374008 -0.067590 0.016762 0.012855 -0.188011 -0.013435 0.069186
polarizability: 1.42698910e+02 -1.39578161e+01 1.17185465e+02 2.32815976e+00 2.97595624e+00 1.15296583e+02
1716.lowfreq: -22.0896 -7.7514 -0.0007 -0.0007 0.0007 11.5920 18.7182 31.0523 49.2438
frequency: 17.3044 30.5619 49.2113 62.2618 63.7252 121.7059 159.2292 193.7612 208.8487 230.1973 247.0433 252.8486 305.5567 323.8788 355.3608 387.6352 415.1994 489.2770 537.7744 592.4850 625.3155 714.3714 721.1986 765.6143 787.1101 812.6469 820.3742 861.9273 869.9685 873.1936 893.2163 956.8884 976.5659 989.3097 1007.6768 1032.3022 1042.5015 1046.0444 1072.4555 1089.1572 1113.4917 1130.2700 1132.7705 1139.6619 1148.5073 1196.6770 1213.5711 1238.1293 1258.5307 1264.9339 1270.9956 1297.5195 1329.1909 1340.6616 1356.8083 1363.0842 1376.8748 1388.0166 1418.4298 1441.8556 1449.9141 1453.4732 1461.6085 1464.2339 1474.1084 1477.1351 1480.8183 1484.7482 1488.9437 1493.2096 1589.3543 2839.1649 2844.7508 2861.7694 2968.7531 2971.0497 2976.0788 2988.0981 3008.4319 3014.5934 3026.7561 3035.8207 3043.1301 3069.8354 3072.8183 3073.7402 3082.7599 3214.5470 3229.9515 3265.9482
redmass: 2.7460 4.1771 3.7203 2.4098 2.9671 2.1983 2.6093 1.6286 1.3745 1.2622 2.1185 1.9688 2.2188 2.1686 2.0420 2.8861 2.2614 2.8369 2.5768 3.2069 3.7785 1.4280 2.8062 1.2871 2.4202 1.5907 2.1912 2.4551 3.3977 1.9084 2.5954 1.8234 1.8173 1.9382 1.6017 1.6411 1.9069 2.2227 2.0442 1.2846 1.7497 1.5489 1.5858 1.8991 1.8820 2.3805 2.1195 1.4559 2.0656 1.6472 1.3325 1.2065 1.4454 1.4602 1.4500 1.9722 1.4269 1.2312 1.1416 1.1600 1.0895 1.0826 1.0512 1.0633 1.0694 1.0563 1.0576 1.0531 1.0566 5.0220 6.8889 1.0674 1.0586 1.0586 1.0657 1.0625 1.0386 1.0783 1.0881 1.0717 1.0722 1.0965 1.0969 1.0984 1.1007 1.1008 1.1003 1.0921 1.0985 1.1082
irintensity: 0.3019 0.3487 0.1898 0.2074 0.4677 1.3906 0.7041 0.8139 0.6095 0.6430 1.3469 1.8192 4.9717 2.3502 6.0303 0.6876 0.7348 6.3868 2.3099 5.7686 0.8561 55.4751 30.9229 21.1746 5.1127 37.1295 8.0701 10.2269 1.2783 2.1789 4.2443 1.2150 4.9629 8.4454 28.9030 26.7628 27.8007 6.3401 0.7873 4.5914 8.7236 21.8634 2.6279 11.2734 1.0074 3.9498 2.0600 4.7417 9.0214 8.4393 4.1707 1.9554 0.5437 0.7359 0.5078 1.1577 1.9288 21.4770 3.8582 2.0995 10.3174 7.8200 15.9340 5.8449 4.2124 20.6888 18.6411 20.2055 6.6533 15.1069 20.0445 61.7145 66.9961 219.1650 18.1826 37.7952 32.8324 5.3229 43.9909 48.6690 41.5744 8.8737 26.4340 56.2659 66.4760 28.5157 46.8914 6.2152 0.7811 0.9090
temp: 298.150 k
press: 1.00000 atm
elementType: 8 7 6 6 6 6 6 6 6 6 6 6 6 1 1 1 1 1 1 1 1 1 1 1 1 1 1 1 1 1 1 1
symmnumber: 1
zpe: 731679.3 jmol-1
zpe.correction: 0.278682 hartree
zpe.thermalcorrener: 0.293598 hartree
zpe.thermalcorrenthalpy: 0.294542 hartree
zpe.thermalcorrgfe: 0.234516 hartree
zpe.sumelectzpe: -559.460512 hartree
zpe.sumelectthermal: -559.445596 hartree
zpe.sumelectthermalent: -559.444652 hartree
zpe.sumelectthermalfe: -559.504677 hartree
dipole: 0.2169 -0.6429 0.8747
dipole: 1.1070
quadrupole: -80.3326 -78.8381 -77.9318
quadrupole: -1.3771 0.4429 1.5082
quadrupole: -1.2984 0.1961 1.1023 -1.3771 0.4429 1.5082
hfenergy: -559.7391938 hartree
pointgroup: C01 [X(C11H19N1O1)]
dipole: 0.0788301 0.2781813 -0.3256947 debye
polarizability: 141.8170356|14.8415816|117.6740651|-1.3042078|3.127414|115.6898577 unknown
InChI: InChI=1S/C11H19NO/c1-4-10(9-12(2)3)8-11-6-5-7-13-11/h5-7,10H,4,8-9H2,1-3H3
charge 0 multiplicity 1
32 atoms
O  2.182074 0.071418 1.049576
N  -2.47378 1.05616 0.051783
C  -0.722173 -0.747791 0.421533
C  -1.259006 0.391169 -0.480528
C  0.577313 -1.355209 -0.19509
C  -1.788677 -1.840234 0.702737
C  1.753509 -0.426561 -0.207434
C  -2.266975 -2.635515 -0.533503
C  -3.14037 1.883594 -0.974108
C  -2.222306 1.824434 1.288175
C  2.58779 0.076179 -1.19437
C  3.57533 0.92091 -0.548924
C  3.299168 0.895452 0.805529
H  -0.42827 -0.314768 1.398912
H  -0.433466 1.129367 -0.657147
H  -1.520991 -0.032534 -1.470236
H  0.391943 -1.675508 -1.237275
H  0.832783 -2.269693 0.378548
H  -1.378464 -2.546914 1.453524
H  -2.664022 -1.344288 1.162606
H  -2.745352 -1.973099 -1.277673
H  -1.43655 -3.169712 -1.031514
H  -3.016232 -3.392594 -0.237716
H  -3.388366 1.2609 -1.852499
H  -2.516724 2.745191 -1.32701
H  -4.083534 2.292158 -0.567897
H  -1.858714 1.159567 2.089973
H  -3.166345 2.282507 1.634143
H  -1.468713 2.642021 1.15025
H  2.506152 -0.131417 -2.259829
H  4.380641 1.471413 -1.031597
H  3.745126 1.355697 1.682659
