program: Gaussian 09
title: 000032966
version: EM64L-G09RevD.01
frameworkgroup: C1[X(C8H18N2O3)]
method: RPBEPBE
basis: SDD
operation: Freq
keyword: #p
keyword: freq=noraman
keyword: PBEPBE/SDD
title: #p freq=noraman PBEPBE/SDD
converged: YES YES NO NO
title: Mulliken charges:
elementType: O O O N N C C C C C C C C H H H H H H H H H H H H H H H H H H
charge: -0.436051 -0.432428 -0.286318 -0.052918 0.040987 -0.413561 -0.385746 -0.345685 -0.344975 -0.377847 -0.384944 -0.330886 -0.325295 0.214711 0.251048 0.213887 0.247193 0.237811 0.200554 0.196627 0.218512 0.211569 0.196178 0.225150 0.185448 0.192204 0.215763 0.183505 0.221766 0.332359 0.331382
chargesum: 0.00000
title: Mulliken charges with hydrogens summed into heavy atoms:
elementType: O O O N N C C C C C C C C
charge: -0.103693 -0.101047 -0.286318 -0.052918 0.040987 0.052198 0.075334 0.092680 0.070164 0.029901 0.025654 0.077082 0.079975
polarizability: 1.37105820e+02 6.71345546e+00 1.15644259e+02 -3.94677055e+00 -6.66676887e+00 9.25494055e+01
1716.lowfreq: -19.4127 -12.4150 -1.4133 -0.0003 0.0001 0.0008 22.7840 29.2188 45.1031
frequency: 19.2602 26.3402 45.0031 52.4942 65.8999 98.4502 104.3110 109.2646 131.8967 143.3807 158.9550 238.3019 278.1864 286.3729 313.7296 326.1027 341.0385 346.1592 401.2759 407.5485 477.1642 527.0823 674.1203 741.3793 751.3801 788.9589 796.7475 842.1123 906.9457 909.3644 950.3776 953.8311 1003.9782 1026.6859 1036.7261 1041.4662 1047.6277 1062.9395 1067.0684 1085.4051 1103.2861 1123.3005 1201.8609 1220.4407 1242.2476 1248.0797 1263.6431 1273.9138 1285.9666 1287.1125 1300.0226 1314.6956 1318.8001 1330.4019 1343.1109 1348.7537 1353.5514 1360.5916 1368.1199 1382.5637 1386.0566 1435.5044 1456.8574 1464.0526 1465.3637 1471.4077 1474.2031 1484.2158 1486.3611 2946.2126 2954.2676 2960.5882 2965.5385 2972.1067 2979.2677 2986.9277 2997.5910 3021.2112 3023.9212 3043.3763 3047.4095 3067.4619 3069.5179 3076.4492 3077.6869 3559.9109 3560.2857
redmass: 2.3041 4.2045 1.9477 3.1450 4.5899 3.7908 2.7595 4.1116 2.0297 2.0987 4.9247 3.7966 5.4818 3.4445 1.1855 1.1526 3.7204 3.2412 3.1483 5.3108 3.9869 4.5118 2.7883 1.2267 1.0835 1.2575 1.1963 4.3036 1.4498 1.3645 4.9780 4.9423 2.4717 4.3802 3.9646 3.3621 3.4333 2.2493 2.0532 1.8934 1.4496 1.3310 1.8579 2.0136 1.2757 1.3833 1.4911 1.3682 1.1130 1.0601 1.4013 1.3211 1.2758 2.3972 1.2939 1.3490 1.3855 1.5091 1.4994 1.2490 1.2523 1.1006 1.0817 1.0712 1.0708 1.0845 1.0875 1.0928 1.0947 1.0696 1.0682 1.0638 1.0613 1.0634 1.0628 1.0594 1.0591 1.0969 1.0935 1.0978 1.1001 1.1001 1.0993 1.1008 1.1006 1.0662 1.0662
irintensity: 0.3786 0.5725 8.2742 8.4413 4.0161 2.9528 2.6101 0.8948 3.1175 1.2055 1.5141 3.4906 1.3630 1.6601 146.4454 156.5169 17.5246 5.3320 7.1215 8.5873 7.9792 13.9082 2.5283 14.0815 13.3576 0.5125 2.5602 17.0557 33.2088 15.7807 121.1155 42.2670 61.3394 60.9502 74.2302 16.0066 5.5464 5.1859 0.4614 18.3019 22.8739 2.6238 56.1751 11.3508 9.7982 5.5892 12.7544 7.0587 9.8659 4.9877 37.3656 29.4054 0.0563 61.5833 4.4901 4.2302 12.4075 1.2346 5.5634 27.1307 20.2462 12.0055 4.3826 0.9481 1.4246 3.4926 2.4557 12.6484 14.4316 59.6339 49.1526 20.2955 26.8412 14.9372 68.6731 4.1922 61.6726 13.5825 10.4072 16.9917 2.8021 6.2132 12.5467 47.1091 91.3544 8.2558 7.2379
temp: 298.150 k
press: 1.00000 atm
elementType: 8 8 8 7 7 6 6 6 6 6 6 6 6 1 1 1 1 1 1 1 1 1 1 1 1 1 1 1 1 1 1
symmnumber: 1
zpe: 691977.2 jmol-1
zpe.correction: 0.263560 hartree
zpe.thermalcorrener: 0.280056 hartree
zpe.thermalcorrenthalpy: 0.281001 hartree
zpe.thermalcorrgfe: 0.216195 hartree
zpe.sumelectzpe: -649.651350 hartree
zpe.sumelectthermal: -649.634853 hartree
zpe.sumelectthermalent: -649.633909 hartree
zpe.sumelectthermalfe: -649.698715 hartree
dipole: -0.7117 -1.3199 3.4054
dipole: 3.7209
quadrupole: -90.0406 -105.6775 -77.4866
quadrupole: 0.7648 -7.2062 3.1324
quadrupole: 1.0276 -14.6093 13.5817 0.7648 -7.2062 3.1324
hfenergy: -649.9149097 hartree
pointgroup: C01[X(C8H18N2O3)]
dipole: 0.1408936 -0.8726006 -1.1669546 debye
polarizability: 135.261687|-9.1284353|118.9310872|-4.4168599|0.6105296|91.1067106 unknown
InChI: InChI=1S/C8H18N2O3/c11-7-3-1-5-10(9-13)6-2-4-8-12/h11-12H,1-8H2
charge 0 multiplicity 1
31 atoms
O  -5.003578 -2.07494 0.838078
O  5.036787 -2.273263 0.378191
O  -1.232937 3.222117 -0.081181
N  0.030612 1.479711 -0.730095
N  -0.033007 2.78585 -0.271003
C  -1.192835 0.694437 -1.005882
C  1.388639 0.961263 -0.972105
C  -1.838092 0.082478 0.262502
C  1.785005 -0.208943 -0.043356
C  -3.141455 -0.673275 -0.080638
C  3.230899 -0.682598 -0.318329
C  -3.792329 -1.305581 1.164013
C  3.644258 -1.853026 0.593866
H  -0.92804 -0.096489 -1.731129
H  -1.920924 1.38287 -1.477233
H  1.472108 0.639766 -2.030335
H  2.071195 1.816502 -0.821276
H  -2.050854 0.898908 0.977552
H  -1.123029 -0.607096 0.751913
H  1.085543 -1.057398 -0.185956
H  1.689404 0.116973 1.01066
H  -2.941916 -1.476187 -0.81779
H  -3.859389 0.029278 -0.553984
H  3.941867 0.151969 -0.164081
H  3.32492 -0.993785 -1.381041
H  -4.010293 -0.522362 1.922414
H  -3.115966 -2.04857 1.62037
H  2.945687 -2.708653 0.461423
H  3.615893 -1.546135 1.653179
H  -5.681085 -1.459833 0.45864
H  5.136107 -2.595289 -0.553389
