program: Gaussian 09
title: 000032967
version: EM64L-G09RevD.01
frameworkgroup: C1[X(C11H22O2)]
method: RPBEPBE
basis: SDD
operation: Freq
keyword: #pfreq=noraman
keyword: PBEPBE/SDD
title: #p freq=noraman PBEPBE/SDD
converged: YES YES NO NO
title: Mulliken charges:
elementType: O O C C C C C C C C C C C H H H H H H H H H H H H H H H H H H H H H H
charge: -0.266929 -0.240034 -0.031188 -0.382983 -0.543047 -0.383706 -0.343461 -0.715605 -0.715408 -0.274543 -0.352184 0.247351 -0.692487 0.204421 0.217150 0.216619 0.253183 0.253206 0.207973 0.207781 0.189175 0.189033 0.215752 0.209416 0.213763 0.215792 0.209214 0.213799 0.222817 0.222307 0.196808 0.197060 0.210640 0.210493 0.217817
chargesum: 0.00000
title: Mulliken charges with hydrogens summed into heavy atoms:
elementType: O O C C C C C C C C C C C
charge: -0.266929 -0.240034 0.173233 0.050787 -0.036658 0.032049 0.034746 -0.076673 -0.076602 0.170581 0.041685 0.247351 -0.053536
polarizability: 1.64759294e+02 -5.48082202e-02 1.14324239e+02 1.07885163e-01 -1.89537044e-01 1.03929027e+02
1716.lowfreq: -30.7276 -23.2809 -5.5969 -0.0003 0.0006 0.0009 4.0521 24.0649 28.3362
frequency: -28.4699 21.5118 24.5353 42.7509 59.5849 87.6338 94.5887 112.8512 116.8044 180.6938 184.4629 216.5286 223.4127 236.7201 243.5775 256.5056 338.4667 351.2316 365.8186 431.5150 479.6719 521.3425 548.5529 681.8820 726.7363 758.2658 761.0672 788.0336 841.3660 861.7106 897.0618 908.8286 930.8720 946.6955 962.7913 965.0326 976.5811 1016.4027 1023.4255 1069.3358 1077.1448 1116.4192 1118.4033 1126.8403 1135.2778 1149.0808 1194.1821 1195.3853 1202.0005 1250.2744 1255.6217 1271.9359 1279.9095 1282.5005 1290.1968 1314.4448 1329.6785 1334.4969 1352.5723 1366.4822 1375.0881 1375.3888 1391.0601 1393.2807 1441.2301 1465.2374 1465.8150 1465.9854 1466.8306 1474.4456 1476.8263 1478.8067 1483.2898 1485.1011 1489.4958 1489.7421 1639.6000 2956.4270 2962.4903 2967.9549 2968.8618 2971.4689 2973.4297 2988.6758 2992.6840 2996.1083 2998.0092 3000.2960 3023.3549 3034.6349 3042.7350 3058.3908 3060.3623 3066.8443 3067.4871 3069.0071 3069.8560 3073.1789 3073.2801
redmass: 2.3380 2.1401 5.1549 4.0451 2.8830 2.2257 1.8697 3.6308 2.0011 2.8698 4.0797 2.9726 1.0999 1.0961 1.1202 4.9321 3.2614 2.0503 2.2246 3.5500 3.7033 2.6894 2.6252 5.0554 1.0692 1.3245 1.1301 3.2303 1.1788 4.4886 2.4545 1.2035 3.7218 1.3170 1.1582 2.1721 1.9677 2.3593 2.6977 2.4259 2.5550 1.7660 2.6849 2.5831 2.2019 1.4881 1.6464 1.5380 1.4281 1.2889 1.2215 1.6972 1.0976 1.1070 1.0895 1.3495 1.5493 1.4549 1.5525 1.4605 1.2222 1.5963 1.2210 1.2239 1.0859 1.0682 1.0647 1.0812 1.0688 1.0722 1.0540 1.0423 1.0718 1.0493 1.0895 1.0549 9.5780 1.0586 1.0813 1.0351 1.0590 1.0360 1.0364 1.0597 1.0634 1.0989 1.0571 1.0592 1.1027 1.0990 1.1042 1.1008 1.1000 1.0999 1.0985 1.1027 1.0990 1.1019 1.1031
irintensity: 0.0803 0.1204 0.6927 0.2581 0.2287 0.0260 0.3485 0.6705 1.3584 6.9156 1.0931 3.5820 0.0769 0.0050 0.8194 4.7593 6.6118 0.1296 2.5038 4.8903 2.1724 2.5002 1.2368 4.9580 10.7664 9.0767 0.8327 8.1202 0.9334 2.4409 21.3924 1.1922 27.4390 1.3471 1.1605 30.3350 0.9205 0.1070 16.5515 51.0635 7.5473 30.8702 267.5490 12.4952 61.2820 0.7171 7.2091 6.5516 0.5052 2.7426 0.0350 130.7103 0.3340 0.1123 0.6268 0.8540 14.8592 2.7456 1.1126 13.7101 21.4098 6.2053 11.7696 18.7421 17.0569 0.1316 8.3696 0.0033 7.9524 3.2006 2.5969 12.8258 0.5724 18.8494 21.0160 20.0677 172.1685 7.5544 21.4453 41.3135 52.5324 20.8366 34.8989 16.6057 14.1936 1.0061 27.5328 41.6779 17.2812 1.9361 8.5568 26.0168 0.8352 36.7725 103.5946 8.8794 73.8104 89.8025 110.0767
temp: 298.150 k
press: 1.00000 atm
elementType: 8 8 6 6 6 6 6 6 6 6 6 6 6 1 1 1 1 1 1 1 1 1 1 1 1 1 1 1 1 1 1 1 1 1 1
symmnumber: 1
zpe: 814480.2 jmol-1
zpe.correction: 0.310219 hartree
zpe.thermalcorrener: 0.326582 hartree
zpe.thermalcorrenthalpy: 0.327526 hartree
zpe.thermalcorrgfe: 0.263872 hartree
zpe.sumelectzpe: -581.744063 hartree
zpe.sumelectthermal: -581.727700 hartree
zpe.sumelectthermalent: -581.726755 hartree
zpe.sumelectthermalfe: -581.790410 hartree
dipole: -0.6579 -1.7096 0.0303
dipole: 1.8321
quadrupole: -72.3849 -89.7586 -80.8522
quadrupole: -2.2161 0.0091 0.2080
quadrupole: 8.6137 -8.7600 0.1463 -2.2161 0.0091 0.2080
hfenergy: -582.0542819 hartree
pointgroup: C01 [X(C11H22O2)]
dipole: 0.2651084 -0.6700066 -0.0186668 debye
polarizability: 164.7540433|0.5265259|114.3251464|0.0151444|0.2881763|103.9333697 unknown
InChI: InChI=1S/C11H22O2/c1-4-5-6-9-13-11(12)8-7-10(2)3/h10H,4-9H2,1-3H3
charge 0 multiplicity 1
35 atoms
O  0.373021 -0.115851 -0.028581
O  -0.715243 1.943082 0.048346
C  -4.63225 -0.155739 0.023311
C  -3.318057 0.674025 0.037862
C  -2.025669 -0.165261 -0.023485
C  2.78058 -0.463988 -0.041391
C  4.192967 0.165383 0.001562
C  -4.757971 -1.087203 1.254265
C  -4.817141 -0.9500 -1.293026
C  1.684094 0.600094 -0.000344
C  5.320396 -0.890708 -0.049457
C  -0.770424 0.6922 0.002994
C  6.730742 -0.264964 -0.000207
H  -5.46002 0.58244 0.082045
H  -3.323764 1.381159 -0.813887
H  -3.292407 1.298992 0.951394
H  -1.98897 -0.786478 -0.938789
H  -1.963356 -0.87562 0.822602
H  2.650015 -1.153345 0.815046
H  2.665606 -1.069114 -0.961342
H  4.303336 0.77079 0.925384
H  4.314429 0.869035 -0.848386
H  -4.62419 -0.525462 2.197933
H  -4.003002 -1.895619 1.228914
H  -5.753523 -1.567803 1.283098
H  -4.723309 -0.290351 -2.176152
H  -4.066219 -1.757136 -1.389527
H  -5.815316 -1.424785 -1.328185
H  1.729957 1.283892 -0.868698
H  1.729026 1.213206 0.919397
H  5.19726 -1.596101 0.797477
H  5.213115 -1.493447 -0.974114
H  6.892742 0.417674 -0.855643
H  6.872694 0.321056 0.927447
H  7.517953 -1.040254 -0.033362
