program: Gaussian 09
title: 000033082
version: EM64L-G09RevD.01
frameworkgroup: C1[X(C19H21N3O2)]
method: RPBEPBE
basis: SDD
operation: Freq
keyword: #p
keyword: freq=noraman
keyword: PBEPBE/SDD
title: #p freq=noraman PBEPBE/SDD
converged: YES YES NO NO
title: Mulliken charges:
elementType: O O N N N C C C C C C C C C C C C C C C C C C C H H H H H H H H H H H H H H H H H H H H H
charge: -0.302236 -0.256397 -0.073254 -0.100601 0.016112 -0.361780 -0.372842 -0.350517 -0.356587 -0.614799 -0.365671 0.070038 0.277841 -0.306606 -0.333917 0.329863 -0.376299 -0.395275 0.347701 -0.361853 -0.385125 -0.204678 -0.193826 -0.251317 0.217678 0.195143 0.194992 0.221200 0.231575 0.227266 0.239242 0.221508 0.192703 0.227715 0.227991 0.223885 0.284834 0.281429 0.262691 0.257038 0.268899 0.257937 0.228487 0.229817 0.229993
chargesum: 0.00000
title: Mulliken charges with hydrogens summed into heavy atoms:
elementType: O O N N N C C C C C C C C C C C C C C C C C C C
charge: -0.302236 -0.256397 -0.073254 -0.100601 0.016112 0.051041 0.043350 0.108324 0.104164 0.033610 -0.141786 0.070038 0.277841 -0.021772 -0.052488 0.329863 -0.113609 -0.138236 0.347701 -0.092954 -0.127188 0.023809 0.035991 -0.021324
polarizability: 3.68189860e+02 -1.46964759e+01 2.73819987e+02 -1.65221466e+01 2.72054986e+00 1.50816209e+02
1716.lowfreq: -10.5856 -3.4412 -0.7470 -0.0009 -0.0006 0.0005 13.2802 24.6969 28.5753
frequency: 12.2136 24.4617 28.4828 38.3618 42.9724 53.4621 77.8199 115.3384 130.3836 153.1520 180.9508 192.7561 208.1457 227.9210 241.4387 270.3890 273.4474 280.6391 320.1529 348.0433 354.2526 374.0081 386.0738 410.0366 414.9314 428.5060 456.0990 477.9881 486.2237 494.2609 552.7731 580.2937 601.0030 613.9265 627.6093 650.3826 675.9771 691.8665 702.8564 746.9578 753.8060 764.3251 777.1946 789.4908 833.1252 839.2513 845.0371 853.6578 863.4095 896.9367 909.0944 936.3676 968.4422 985.6926 986.7308 988.9014 990.7930 998.4558 1005.4502 1018.7462 1025.3677 1049.9270 1069.9546 1072.9089 1076.5538 1085.8710 1110.9280 1117.5954 1148.0709 1152.3838 1158.7159 1161.5406 1169.3932 1173.8843 1188.4616 1198.3548 1220.2991 1241.9113 1279.1554 1287.4226 1296.2277 1302.1165 1307.4794 1309.2120 1338.8208 1350.7032 1364.7533 1366.3108 1372.6304 1381.3550 1385.0030 1419.3514 1432.3707 1441.5596 1454.2941 1457.0090 1459.5320 1464.1354 1469.9816 1475.7524 1481.9247 1488.4620 1502.3522 1537.5469 1579.3239 1594.6426 1600.6906 1616.3843 2849.3055 2854.2380 2874.2618 2958.0393 2962.1557 3026.0805 3038.5326 3045.1533 3055.6960 3066.1914 3083.4018 3088.0675 3130.6001 3140.2978 3152.0299 3153.1135 3156.6049 3165.4091 3171.6390 3174.7809 3182.6992
redmass: 4.4927 4.1847 4.1469 4.5540 3.6740 4.5113 4.9830 6.6135 4.4401 4.2769 6.3964 3.6215 1.5131 3.9951 1.4661 2.7711 4.7522 5.1869 3.0917 2.9090 5.4831 3.3499 2.3479 2.9406 3.0319 6.3716 4.8457 3.3174 3.3054 3.1526 4.9534 5.8815 4.7836 4.7040 4.3488 4.3791 3.8702 2.5669 3.5853 4.2329 2.4026 2.5427 3.4150 4.0080 1.2793 1.5463 1.2471 4.9998 1.6691 1.6271 1.4244 1.9855 1.3635 1.3890 5.2335 1.3560 2.3790 1.3569 2.9892 2.1021 2.3907 1.6609 1.6779 2.0245 1.5062 2.8475 1.3109 1.5104 2.5836 2.1048 2.7653 2.1846 1.1092 1.2617 1.4606 1.0782 3.4667 3.2631 1.6208 1.5505 1.3319 2.1129 1.3596 1.4127 1.2797 1.4421 1.4055 3.7738 2.2057 1.8062 6.9458 4.2439 1.1719 2.2985 1.0850 1.0761 1.1030 1.0613 2.2519 1.1051 1.0529 2.5855 8.4438 5.1398 7.4565 6.3953 6.5367 6.4755 1.0713 1.0672 1.0584 1.0661 1.0678 1.0742 1.0883 1.0899 1.0910 1.0904 1.1011 1.0939 1.0850 1.0892 1.0882 1.0900 1.0928 1.0964 1.0965 1.1003 1.0950
irintensity: 0.1032 0.3520 0.9470 0.4038 1.6552 0.1364 1.4362 1.5367 2.8607 6.7566 2.9193 0.9121 1.9701 0.5487 1.4394 21.7395 2.0224 0.1297 2.0819 3.5390 11.2172 15.5301 18.0034 0.8615 0.7129 4.5688 0.4948 16.7894 1.8390 25.0566 2.4260 3.9723 5.4321 1.5913 13.8864 17.3361 23.2841 10.7040 46.8655 7.7097 55.6795 15.8354 17.1990 34.4697 1.9409 4.5669 0.1667 78.9123 76.5279 22.1816 5.8166 2.1473 0.2151 1.5926 3.8045 4.6075 120.4579 0.6242 10.4504 13.8829 23.3323 2.4798 12.0251 17.1100 12.4373 31.1103 11.8759 71.8124 111.1877 17.2775 65.9369 109.7505 5.9154 93.4442 81.5296 2.7649 492.7843 5.8801 12.0557 22.8751 27.0847 268.3070 103.7505 107.6395 27.2038 11.9237 9.6316 0.1211 37.4203 18.9033 19.3082 34.9929 2.3575 3.6335 14.4362 0.4499 79.7263 13.3032 186.1533 14.2020 9.2643 64.2655 150.2213 312.9667 58.5355 63.6919 181.1995 33.1327 47.0364 53.8877 210.3072 20.2092 72.0116 46.2807 43.0111 43.8471 26.7721 35.3655 29.7197 16.2677 1.9538 11.5411 1.1954 10.6064 24.3551 13.1397 7.4044 8.5016 16.5928
temp: 298.150 k
press: 1.00000 atm
elementType: 8 8 7 7 7 6 6 6 6 6 6 6 6 6 6 6 6 6 6 6 6 6 6 6 1 1 1 1 1 1 1 1 1 1 1 1 1 1 1 1 1 1 1 1 1
symmnumber: 1
zpe: 954131.8 jmol-1
zpe.correction: 0.363410 hartree
zpe.thermalcorrener: 0.385115 hartree
zpe.thermalcorrenthalpy: 0.386059 hartree
zpe.thermalcorrgfe: 0.309260 hartree
zpe.sumelectzpe: -1049.515965 hartree
zpe.sumelectthermal: -1049.494260 hartree
zpe.sumelectthermalent: -1049.493316 hartree
zpe.sumelectthermalfe: -1049.570115 hartree
dipole: -3.8154 -6.2768 0.3787
dipole: 7.3552
quadrupole: -108.5220 -148.0114 -141.0051
quadrupole: 2.4926 -4.7384 -3.0970
quadrupole: 23.9909 -15.4986 -8.4923 2.4926 -4.7384 -3.0970
hfenergy: -1049.8793749 hartree
pointgroup: C01 [X(C19H21N3O2)]
dipole: -1.6080602 -2.2504129 0.8507168 debye
polarizability: 367.8481739|-15.0305072|259.6840831|13.1612436|-41.2977862|165.2937993 unknown
InChI: InChI=1S/C19H21N3O2/c1-21-11-13-22(14-12-21)20-15-19(23)16-7-9-18(10-8-16)24-17-5-3-2-4-6-17/h2-10,15H,11-14H2,1H3
charge 0 multiplicity 1
45 atoms
O  4.24357 0.429322 -0.436881
O  -1.196689 3.710905 -1.216442
N  -6.081262 -1.784717 -0.469557
N  -3.685952 -0.224533 -0.638016
N  -2.482688 0.401742 -0.738628
C  -4.779852 -2.384498 -0.092713
C  -6.104128 -0.352835 -0.098729
C  -3.642492 -1.686233 -0.853585
C  -5.001036 0.430684 -0.836783
C  -7.23321 -2.529141 0.077198
C  -2.387008 1.718653 -0.890743
C  -1.104992 2.45348 -0.975182
C  0.252462 1.830063 -0.806293
C  0.486524 0.48307 -0.413667
C  1.377561 2.670191 -1.047809
C  2.895707 0.8525 -0.494816
C  1.79799 -0.007533 -0.254554
C  2.689058 2.192013 -0.899568
C  4.655189 -0.611519 0.436406
C  4.159946 -0.739126 1.755419
C  5.678134 -1.457216 -0.044773
C  4.694419 -1.743871 2.592038
C  6.205436 -2.454186 0.805203
C  5.714124 -2.605641 2.123415
H  -4.785662 -3.455848 -0.363756
H  -4.59413 -2.307818 1.009677
H  -5.969799 -0.211905 1.005094
H  -7.084411 0.075683 -0.376736
H  -2.655857 -2.040454 -0.513808
H  -3.744393 -1.907342 -1.936988
H  -5.234748 0.490467 -1.921039
H  -4.963745 1.456221 -0.430408
H  -7.265798 -2.537752 1.195571
H  -7.196405 -3.575913 -0.272701
H  -8.17327 -2.080515 -0.289885
H  -3.251947 2.392877 -1.001331
H  -0.367347 -0.175939 -0.245216
H  1.185615 3.705644 -1.346956
H  1.966017 -1.048425 0.038487
H  3.558218 2.829246 -1.087283
H  3.384726 -0.059993 2.123663
H  6.044254 -1.319528 -1.066521
H  4.317936 -1.844499 3.616069
H  6.99931 -3.112505 0.435698
H  6.124928 -3.380477 2.779231
