program: Gaussian 09
title: 000032965
version: EM64L-G09RevD.01
frameworkgroup: C1[X(C7H16N2O)]
method: RPBEPBE
basis: SDD
operation: Freq
keyword: #p
keyword: freq=noraman
keyword: PBEPBE/SDD
title: #p freq=noraman PBEPBE/SDD
converged: YES YES NO NO
title: Mulliken charges:
elementType: O N N C C C C C C C H H H H H H H H H H H H H H H H
charge: -0.297489 -0.066122 0.042832 -0.391661 -0.326970 -0.338324 -0.334776 -0.371920 -0.691610 -0.677168 0.208803 0.251672 0.185318 0.227472 0.212947 0.233796 0.205278 0.190652 0.193417 0.236668 0.209657 0.218653 0.217836 0.197340 0.245038 0.218659
chargesum: 0.00000
title: Mulliken charges with hydrogens summed into heavy atoms:
elementType: O N N C C C C C C C
charge: -0.297489 -0.066122 0.042832 0.068814 0.085820 0.108419 0.061154 0.058165 -0.045463 -0.016131
polarizability: 1.07939770e+02 -1.66981202e+00 9.35304158e+01 -6.02961038e-01 -8.18064877e+00 8.45738862e+01
1716.lowfreq: -10.6741 -7.3829 0.0005 0.0006 0.0008 11.2613 23.1981 40.7714 73.2831
frequency: 22.9966 40.6509 73.2475 96.6355 108.4740 129.9827 178.9216 211.0246 237.2449 257.6381 279.2418 333.2583 341.2257 376.5696 462.1623 525.8460 619.8691 728.5666 758.6131 792.3061 832.5588 870.1018 897.0160 908.7159 922.8426 1005.9359 1016.0617 1070.1670 1083.0965 1096.4924 1105.0574 1113.0318 1174.7678 1200.0291 1245.2828 1249.8997 1264.5720 1280.8614 1291.1416 1320.6123 1328.1718 1343.7401 1351.4439 1356.1492 1376.1971 1390.9845 1393.7797 1442.8433 1463.2364 1466.6744 1472.5825 1475.6576 1478.2355 1481.2518 1486.9413 1488.8410 2953.8399 2966.6891 2975.6741 2977.6967 2982.0650 2996.9206 2999.1604 3009.1512 3013.5254 3044.0692 3059.9883 3068.7039 3074.7430 3076.9901 3079.7387 3096.0917
redmass: 3.6532 2.9233 1.6527 3.1660 2.3688 2.4617 1.5111 3.3598 1.0902 2.1805 3.0902 3.7199 2.4472 2.7620 3.5298 3.8369 3.1547 1.1177 1.3305 1.2970 3.1209 2.3922 1.6500 1.4404 1.3652 1.7535 3.7814 2.5746 3.2305 1.5554 1.9266 2.2310 2.6189 2.0525 1.3958 1.3180 1.2794 1.1957 1.0920 3.4884 1.5909 1.4757 1.4532 1.4280 1.3903 1.2116 1.2404 1.1016 1.0758 1.0729 1.0644 1.0627 1.0438 1.0690 1.0769 1.0535 1.0603 1.0590 1.0396 1.0596 1.0374 1.0651 1.0605 1.0983 1.0967 1.1002 1.0966 1.1035 1.1011 1.1009 1.0985 1.1001
irintensity: 0.8894 2.5479 0.2008 0.9934 0.4327 0.2562 2.4277 2.0182 0.0647 1.4710 0.5062 0.7048 4.2618 1.2858 6.3923 1.8145 2.1490 7.7445 7.5864 5.6832 8.3696 2.1358 3.5998 13.4416 21.1207 56.5591 2.3447 0.2029 26.8948 4.4429 0.3199 23.9396 49.4891 1.9534 12.6416 6.7428 2.4801 6.5861 1.8885 62.4051 28.5759 6.8520 0.8811 1.2076 2.7674 15.2733 10.7060 10.3375 9.5815 2.7690 6.3046 4.5262 14.0633 12.7732 23.4705 13.0934 31.7520 24.5008 23.9183 31.6005 36.9523 28.6331 52.7644 32.5459 10.7997 6.6568 7.5571 2.2298 71.2487 61.3275 53.2786 39.4190
temp: 298.150 k
press: 1.00000 atm
elementType: 8 7 7 6 6 6 6 6 6 6 1 1 1 1 1 1 1 1 1 1 1 1 1 1 1 1
symmnumber: 1
zpe: 596305.5 jmol-1
zpe.correction: 0.227121 hartree
zpe.thermalcorrener: 0.239863 hartree
zpe.thermalcorrenthalpy: 0.240808 hartree
zpe.thermalcorrgfe: 0.186616 hartree
zpe.sumelectzpe: -460.168803 hartree
zpe.sumelectthermal: -460.156060 hartree
zpe.sumelectthermalent: -460.155116 hartree
zpe.sumelectthermalfe: -460.209308 hartree
dipole: -0.8318 -3.6938 2.6157
dipole: 4.6020
quadrupole: -59.8229 -70.6732 -62.2232
quadrupole: -4.2502 2.0574 3.0338
quadrupole: 4.4168 -6.4334 2.0166 -4.2502 2.0574 3.0338
hfenergy: -460.3959234 hartree
pointgroup: C01 [X(C7H16N2O1)]
dipole: -0.5150783 1.1199217 -1.3261097 debye
dipolederiv: -0.2613575 -0.3785812 0.3073253 0.1421695 -0.7263118 0.4918887 -0.1373291 0.3235053 -0.568943 -0.319544 0.2782657 -0.2448425 0.0264373 -0.4522445 0.2264858 0.0010531 0.3122154 -0.5682715 -0.058539 -0.0051121 0.085477 -0.2566737 0.5931112 -0.7055607 0.2365738 -0.7254597 0.695661 0.2296554 -0.0013628 0.0152401 0.0108416 0.0943897 0.118927 0.025153 0.063596 0.2233596 -0.0218452 -0.0056422 -0.0246908 -0.0115257 0.1192895 -0.0977892 -0.0567084 -0.0355553 0.0129434 0.2317461 0.0908944 -0.1759481 0.1126805 0.4023727 -0.1346734 -0.2163859 -0.0648473 0.2672308 0.0733841 0.0202954 0.0125561 0.0736011 0.1113879 -0.0271794 0.0798345 -0.0507437 0.1634279 0.0567116 0.0089212 -0.0174626 0.004865 0.1195384 -0.0098008 0.000071 -0.0361119 0.0962093 -0.0599819 0.0431375 0.0292397 0.0062772 0.0695075 -0.0340174 0.0028006 -0.0267775 0.0522613 0.0302789 -0.042128 0.0319793 -0.0324754 0.0175685 -0.0562686 0.0050415 -0.0495722 -0.0465386 0.023061 0.022536 -0.0154651 0.0090615 0.1094982 0.0388103 -0.000077 0.0050939 -0.1420199 0.0421952 -0.0071699 -0.0081136 -0.0576658 -0.0574528 -0.0404466 0.0358853 0.0630305 0.0903804 0.0298285 -0.0333191 0.0152767 -0.0444712 -0.1743096 0.0116812 0.0186657 0.0397641 0.0606382 0.0507471 0.0067883 -0.0247531 -0.0030659 0.0653119 0.0297289 -0.0167076 -0.0076577 -0.1150791 -0.0623108 0.0849281 -0.0250554 0.0800426 -0.0645455 0.0805251 0.0085494 0.0279416 0.0566117 0.0352853 -0.0578083 0.0622841 -0.0175852 -0.0316363 -0.0927429 0.0611007 -0.0277674 -0.165583 0.0316394 0.0110855 0.0027936 -0.030884 -0.1848553 0.0039747 0.0069554 0.0326679 0.0687498 0.0263684 0.0019949 0.0143315 0.0070916 0.0694001 0.0328239 -0.0306665 0.002723 -0.2079606 0.0173483 -0.0761057 0.0705063 -0.119943 -0.0325926 0.0958198 0.085762 0.0774295 -0.0841583 0.0076176 0.0941571 -0.0132181 0.1311758 -0.0267225 -0.0152557 -0.0616461 -0.0221711 0.0561195 0.0856942 -0.0459435 0.0220249 0.0179932 -0.1789518 0.0224485 0.0223858 0.0483532 0.0717321 -0.210693 -0.0412278 -0.0462495 -0.0606547 0.0705125 -0.027692 -0.06107 -0.0302076 0.0748351 0.0892273 0.0199753 -0.044638 0.0217223 0.0742596 0.0427287 0.0174157 0.0173078 -0.167818 -0.0315726 0.159346 -0.0174298 0.1214555 -0.0466266 0.0014154 -0.045525 0.0469845 0.0454929 0.0666263 -0.0263477 0.0813009 -0.0254069 0.0404433 0.1137121 0.0966309 0.0855035 -0.0166909 -0.1015706 -0.1215774 -0.0924688 -0.1050636 0.0196583 -0.0695434 -0.0777628 -0.0692448 0.0474099 unknown
polarizability: 106.7906207|4.8013475|90.7295362|1.9444813|-9.0991132|88.5239155 unknown
InChI: InChI=1S/C7H16N2O/c1-3-5-7-9(8-10)6-4-2/h3-7H2,1-2H3
charge 0 multiplicity 1
26 atoms
O  0.727336 -1.82035 1.33146
N  0.708975 -0.283032 -0.306333
N  1.395829 -0.898154 0.718355
C  -0.669358 -0.679332 -0.675517
C  -1.751542 0.113198 0.09612
C  1.418934 0.760761 -1.084679
C  -3.177812 -0.309895 -0.323624
C  2.65762 1.358603 -0.38598
C  -4.273459 0.463587 0.440876
C  2.334654 2.149102 0.899148
H  -0.783849 -0.531291 -1.765714
H  -0.769576 -1.756572 -0.446296
H  -1.619136 1.199889 -0.081674
H  -1.613738 -0.059347 1.180208
H  0.686125 1.566163 -1.292481
H  1.713028 0.326446 -2.063492
H  -3.300859 -1.397379 -0.147268
H  -3.304435 -0.152045 -1.414574
H  3.140124 2.029278 -1.124461
H  3.377902 0.553737 -0.158209
H  -4.191873 1.552214 0.26154
H  -5.284153 0.144453 0.1274
H  -4.188778 0.29549 1.5306
H  1.596406 2.950372 0.70431
H  1.928896 1.482513 1.67896
H  3.247738 2.62299 1.302223
