program: Gaussian 09
title: 000032995
version: EM64L-G09RevD.01
frameworkgroup: C1[X(C12H16N2O2)]
method: RPBEPBE
basis: SDD
operation: Freq
keyword: #p
keyword: freq=noraman
keyword: PBEPBE/SDD
title: #p freq=noraman PBEPBE/SDD
converged: YES YES NO NO
title: Mulliken charges:
elementType: O O N N C C C C C C C C C C C C H H H H H H H H H H H H H H H H
charge: -0.287581 -0.312761 -0.369872 -0.117274 -0.673402 -0.439602 0.470169 0.235783 0.234927 -0.371691 -0.426380 -0.609344 -0.628220 -0.221474 -0.221249 -0.245613 0.248102 0.212547 0.259236 0.263055 0.352121 0.269296 0.227684 0.227053 0.226842 0.284417 0.265010 0.238101 0.235917 0.224185 0.223833 0.226182
chargesum: 0.00000
title: Mulliken charges with hydrogens summed into heavy atoms:
elementType: O O N N C C C C C C C C C C C C
charge: -0.287581 -0.312761 -0.017751 -0.117274 -0.212753 0.082689 0.470169 0.235783 0.234927 -0.102395 -0.198696 0.128968 0.110808 0.002711 0.002585 -0.019431
polarizability: 1.79834817e+02 -9.13338310e+00 1.42885660e+02 1.16488559e+01 1.13961488e+01 1.16060284e+02
1716.lowfreq: -10.8355 -4.2357 -0.0010 -0.0007 -0.0001 5.1982 12.3177 19.6946 26.4430
frequency: -8.8034 18.9412 26.3335 50.3716 56.3058 93.0638 110.6895 125.4124 140.4918 184.8264 222.1150 253.7484 257.0144 282.4080 305.4069 373.7304 403.9503 406.6130 464.9096 492.5922 520.5950 548.9271 579.4889 613.6420 627.3197 689.7034 701.3349 718.6466 750.6202 788.6279 828.5379 854.8995 909.4292 935.3263 953.0709 961.3350 977.1560 981.9520 989.3935 995.6896 1027.8548 1055.1921 1074.7800 1093.0307 1101.1620 1144.1180 1146.3018 1170.9811 1176.5805 1189.1709 1205.6495 1220.7961 1240.6848 1242.8867 1282.3531 1320.1709 1335.0132 1382.9331 1403.6171 1414.7865 1440.5860 1448.9957 1456.5843 1469.2380 1472.1333 1473.0807 1480.3406 1486.5205 1488.1433 1508.5027 1589.3449 1595.0140 1609.0752 1615.9845 2970.6008 2971.6043 2975.8277 3003.5952 3013.1181 3040.5653 3051.0455 3064.7769 3114.5601 3123.8963 3124.3051 3131.4431 3136.7157 3147.8986 3162.3764 3464.7356
redmass: 2.1171 2.6504 3.5830 2.7545 3.1805 4.6771 5.2244 2.5043 1.2828 3.8894 3.0056 4.8429 2.6100 4.6863 3.1121 3.6948 2.7978 2.5656 3.0142 3.7103 4.4477 3.0927 5.2072 5.7877 4.6687 1.2365 2.4403 2.0827 2.4734 4.0995 3.8241 1.2480 1.5735 2.0231 3.1833 3.4622 1.4012 2.0232 5.0713 1.3665 2.2274 1.3766 1.7014 1.2244 2.0959 1.4740 1.3985 1.0896 2.0789 1.1304 2.4993 1.0894 5.7833 1.4031 1.4925 1.6316 1.3839 7.9528 2.6245 1.1744 2.1876 1.2156 1.1932 1.1962 1.2685 1.2841 1.3287 1.8631 1.0453 1.2639 7.3645 6.0085 5.6446 6.0001 1.0375 1.0585 1.0369 1.0589 1.1013 1.1013 1.1019 1.1029 1.0866 1.0977 1.0867 1.0950 1.0920 1.0960 1.1016 1.0780
irintensity: 1.4230 0.2191 0.1080 2.9425 2.6505 7.9732 14.2370 1.4750 0.3878 1.0434 3.8298 3.2982 8.1971 3.3819 8.4542 24.6749 0.5637 4.3846 1.4203 19.8762 18.2060 3.5552 17.3533 1.5484 4.1559 90.2879 19.9356 60.7237 32.8837 0.8168 3.1164 0.4461 1.4964 4.7792 40.4653 9.6293 0.6559 0.3451 0.1988 1.0795 10.9327 6.6471 3.3775 0.2090 22.3092 94.4579 18.1337 3.1360 20.8806 0.5235 3.1323 1.3564 29.1251 14.6467 14.3554 4.5072 5.3828 1.4007 141.3765 42.2599 8.3679 3.9907 71.6850 87.9862 103.7890 135.3187 77.2508 76.7698 33.2669 39.3390 194.2311 88.5669 77.1559 69.3296 30.9080 55.0367 83.2660 21.6999 16.3815 35.5943 29.0702 11.2867 8.3276 1.2144 0.9995 14.3294 24.3013 26.0183 24.1879 134.8253
temp: 298.150 k
press: 1.00000 atm
elementType: 8 8 7 7 6 6 6 6 6 6 6 6 6 6 6 6 1 1 1 1 1 1 1 1 1 1 1 1 1 1 1 1
symmnumber: 1
zpe: 688171.5 jmol-1
zpe.correction: 0.262111 hartree
zpe.thermalcorrener: 0.277822 hartree
zpe.thermalcorrenthalpy: 0.278767 hartree
zpe.thermalcorrgfe: 0.216394 hartree
zpe.sumelectzpe: -725.652378 hartree
zpe.sumelectthermal: -725.636667 hartree
zpe.sumelectthermalent: -725.635722 hartree
zpe.sumelectthermalfe: -725.698095 hartree
dipole: -4.3059 -0.7814 1.3732
dipole: 4.5866
quadrupole: -69.7880 -101.9281 -91.3743
quadrupole: -8.3121 -5.6978 0.2943
quadrupole: 17.9088 -14.2313 -3.6775 -8.3121 -5.6978 0.2943
hfenergy: -725.9144889 hartree
pointgroup: C01 [X(C12H16N2O2)]
dipole: 1.6803639 0.5630647 0.3400393 debye
polarizability: 180.4713443|-10.8648057|130.6763292|-8.4550212|-17.4550753|127.6330875 unknown
InChI: InChI=1S/C12H16N2O2/c1-14(2)12(16)9-13-11(15)8-10-6-4-3-5-7-10/h3-7,13H,8-9H2,1-2H3
charge 0 multiplicity 1
32 atoms
O  -0.103546 -2.305215 0.474115
O  2.691952 1.182057 -1.468431
N  0.878694 -0.571528 -0.705785
N  4.320426 0.553408 0.076082
C  -1.436193 -1.200885 -1.28322
C  2.119439 -0.636794 0.057341
C  -2.514623 -0.432397 -0.518949
C  -0.171761 -1.416668 -0.435695
C  3.071402 0.438116 -0.503158
C  -3.036104 -0.944264 0.698175
C  -3.012848 0.798611 -1.013569
C  5.255464 1.577345 -0.42461
C  4.804282 -0.267781 1.196662
C  -4.036865 -0.23774 1.400449
C  -4.016975 1.50565 -0.311657
C  -4.533437 0.988658 0.897971
H  -1.807875 -2.208396 -1.545319
H  -1.193215 -0.676278 -2.225041
H  2.565931 -1.647983 -0.022525
H  1.918334 -0.469338 1.134475
H  0.851992 0.161222 -1.426044
H  -2.639773 -1.886959 1.092477
H  -2.618185 1.205563 -1.953127
H  6.183305 1.103656 -0.797557
H  5.518862 2.287635 0.382016
H  4.767149 2.122124 -1.24611
H  4.07352 -1.038527 1.478098
H  5.000699 0.363983 2.084715
H  5.74814 -0.774306 0.918078
H  -4.430871 -0.644136 2.339124
H  -4.393519 2.455227 -0.709038
H  -5.312699 1.533743 1.442656
