program: Gaussian 09
title: 000032935
version: EM64L-G09RevD.01
frameworkgroup: C1[X(C8H16)]
method: RPBEPBE
basis: SDD
operation: Freq
keyword: #p
keyword: freq=noraman
keyword: PBEPBE/SDD
title: #p freq=noraman PBEPBE/SDD
converged: YES YES NO NO
title: Mulliken charges:
elementType: C C C C C C C C H H H H H H H H H H H H H H H H
charge: -0.345912 -0.446722 -0.347216 -0.184998 -0.693707 -0.179988 -0.436068 -0.670222 0.188500 0.204217 0.200663 0.192328 0.195657 0.192404 0.222924 0.209520 0.210698 0.215086 0.218870 0.202254 0.206173 0.214021 0.221689 0.209831
chargesum: 0.00000
title: Mulliken charges with hydrogens summed into heavy atoms:
elementType: C C C C C C C C
charge: 0.046805 -0.053732 0.040844 0.037926 -0.058404 0.038882 -0.027641 -0.024681
polarizability: 1.20228195e+02 -3.71265274e+00 7.28569514e+01 4.82854484e+00 -5.45765108e-01 7.54830877e+01
1716.lowfreq: -16.5977 -5.2734 -0.0007 -0.0005 0.0004 4.2241 35.5128 68.1572 89.0757
frequency: 35.3031 67.9597 89.0656 95.8254 133.4316 191.7228 203.1859 230.7256 272.1384 312.5192 402.0758 431.4547 512.2947 726.1895 770.2743 776.2872 814.3695 878.2471 899.9052 924.6208 970.9110 991.1711 1018.2352 1045.8571 1066.9561 1069.3190 1102.8198 1110.0369 1166.2125 1205.5392 1235.1579 1248.8291 1265.6697 1282.9123 1287.8586 1294.7579 1314.8672 1339.3826 1348.2658 1385.3726 1388.5038 1458.8721 1464.0599 1466.2567 1473.8860 1476.2171 1477.4606 1484.5518 1487.1977 1685.1656 2949.3487 2960.2052 2961.9057 2969.0362 2971.7815 2976.2171 2998.4814 3011.6050 3022.8218 3037.6551 3059.3411 3067.4624 3069.0060 3070.3350 3073.9188 3081.6985
redmass: 2.6470 1.7629 2.2963 2.3133 2.1026 1.8154 1.4883 1.1327 1.8033 3.8507 2.2006 2.8506 2.5557 1.0797 1.2402 1.2308 1.5669 1.6276 1.7647 1.3551 1.1579 2.1902 3.0400 1.3975 1.8386 2.4645 2.1470 2.2175 2.1613 1.4753 1.2693 1.2303 1.1970 1.1022 1.2405 1.2265 1.3825 1.4529 1.6019 1.2034 1.2152 1.0846 1.0751 1.0725 1.0431 1.0577 1.0545 1.0627 1.0819 6.5910 1.0615 1.0590 1.0620 1.0608 1.0362 1.0354 1.0958 1.0994 1.0969 1.1031 1.0941 1.0934 1.0984 1.0994 1.0961 1.1006
irintensity: 0.1244 0.0333 0.3360 0.0448 0.2033 0.4710 0.2353 0.0161 0.4988 0.5661 0.3685 3.2619 0.3558 9.1197 6.2968 1.0386 1.5840 6.7956 0.8227 10.9139 43.8214 13.8701 0.1753 16.0310 2.9883 0.2422 6.1491 3.3681 0.2585 0.4628 0.6758 0.2450 0.5516 0.5349 2.8784 0.2783 1.0603 0.5064 0.9588 10.2290 11.2380 2.4497 7.2244 0.5913 11.5601 7.7700 9.1171 10.7397 17.6278 0.1023 23.9512 0.3215 44.5749 86.9479 42.2141 39.4656 5.7233 1.1804 9.8987 47.8134 1.0742 3.5674 89.6233 60.1880 121.8259 58.1638
temp: 298.150 k
press: 1.00000 atm
elementType: 6 6 6 6 6 6 6 6 1 1 1 1 1 1 1 1 1 1 1 1 1 1 1 1
symmnumber: 1
zpe: 572178.2 jmol-1
zpe.correction: 0.217931 hartree
zpe.thermalcorrener: 0.228870 hartree
zpe.thermalcorrenthalpy: 0.229814 hartree
zpe.thermalcorrgfe: 0.180616 hartree
zpe.sumelectzpe: -313.759452 hartree
zpe.sumelectthermal: -313.748513 hartree
zpe.sumelectthermalent: -313.747569 hartree
zpe.sumelectthermalfe: -313.796767 hartree
dipole: 0.0533 0.0502 -0.0064
dipole: 0.0735
quadrupole: -51.0605 -54.3680 -50.7697
quadrupole: -0.8800 0.1101 -0.2186
quadrupole: 1.0056 -2.3020 1.2964 -0.8800 0.1101 -0.2186
hfenergy: -313.9773836 hartree
pointgroup: C01 [X(C8H16)]
dipole: 0.021462 -0.0191096 0.0031893 debye
dipolederiv: -0.0253711 0.0128716 -0.0198912 -0.0636318 0.0716198 -0.0350755 -0.1138289 -0.0526577 0.1626681 -0.1206492 0.0224432 -0.029417 0.0383505 0.1735912 -0.0491402 0.0201461 -0.0128975 0.1170984 0.0436766 0.0259296 -0.0135938 0.099813 0.1189187 -0.0379422 0.0373849 -0.0357487 0.1496265 0.1156972 0.0572993 0.0075183 0.1587109 -0.26376 0.0131196 0.1268723 0.0077635 0.1269847 -0.071153 0.0665586 0.0146043 0.0314102 0.0348667 -0.0198786 -0.0180186 -0.0196286 0.0864887 0.0729609 0.1097847 -0.0055595 0.0378586 -0.2749218 0.0298793 0.0803674 0.0699786 0.118789 0.0190055 -0.0649523 -0.0340262 -0.0867918 0.1333202 0.0266685 0.0540112 0.0222979 0.1086123 -0.0031815 -0.0489623 0.014566 -0.0093576 0.0002593 0.0292137 -0.0694952 0.0161081 0.0879505 0.0475339 0.009768 0.000729 0.0009079 0.0575122 -0.0189636 0.0013057 -0.0458399 -0.1956444 0.0315968 -0.0530952 0.0124449 -0.043835 -0.1489555 0.0545296 0.0172412 0.0771908 0.0406396 0.0329239 0.0117655 0.0288986 0.0191778 0.0639634 0.0002951 -0.0156512 -0.0485468 -0.1742438 -0.0374496 -0.1055731 0.0276275 -0.091058 -0.1351755 0.054663 -0.0031872 0.0789523 0.0582336 0.0311715 0.0201204 0.0388106 0.0082008 0.0592025 -0.0337613 -0.0071975 -0.0530642 -0.200657 0.0157213 -0.0303221 0.0085533 -0.0653125 -0.1811494 0.0627617 0.0223713 0.0916722 0.0469182 0.0332542 -0.0241503 -0.0270116 -0.0470094 0.1460167 -0.0266324 -0.0538699 -0.0190196 -0.1469569 0.0897117 0.013991 -0.0057455 0.0248891 0.0697449 -0.0096707 0.0555209 -0.04287 -0.1866775 0.0728406 -0.079821 0.0404811 -0.0130212 -0.1476132 0.071375 0.0318098 0.0883598 0.0524856 -0.2181833 -0.0185717 -0.0755796 -0.0382765 0.0689224 -0.0306773 -0.0969793 -0.0235633 0.0630033 0.0291293 -0.0342145 -0.0353275 -0.0161733 0.1514061 -0.0138648 -0.0476944 -0.0259446 -0.1506381 -0.1308215 0.0947045 0.0303624 0.1049945 -0.0813212 -0.0275834 0.016812 -0.0624015 0.0796804 0.0521953 -0.0268168 0.0536501 -0.0376725 0.0517947 0.0099538 -0.0308636 0.0208734 -0.1837902 -0.207733 -0.0951485 -0.0735928 -0.0980926 0.0481969 0.0021206 -0.09455 -0.012762 0.0595502 0.0192246 0.1411178 0.0462072 0.0826693 -0.0811451 -0.0306026 0.050719 -0.0495244 0.0659984 0.1078989 -0.0047265 -0.0047086 0.0032497 0.0647058 -0.0207874 0.0367741 0.0312723 -0.1861195 unknown
polarizability: 119.966634|4.6342891|73.0110763|-5.2567794|-0.5853399|75.5905243 unknown
InChI: InChI=1S/C8H16/c1-3-5-7-8-6-4-2/h5,7H,3-4,6,8H2,1-2H3
charge 0 multiplicity 1
24 atoms
C  1.707087 -0.134286 -0.253331
C  0.636128 0.918505 0.141055
C  3.115268 0.208976 0.283665
C  -0.73323 0.610314 -0.428899
C  4.179063 -0.840215 -0.105633
C  -1.858993 0.397092 0.302122
C  -3.224815 0.063718 -0.264289
C  -3.768174 -1.29186 0.257571
H  1.747228 -0.2203 -1.359267
H  1.395516 -1.12843 0.125773
H  0.574813 0.98762 1.245431
H  0.9782 1.912144 -0.220732
H  3.07096 0.301234 1.38817
H  3.418144 1.205373 -0.099037
H  -0.795686 0.54538 -1.528126
H  4.264957 -0.928075 -1.205287
H  3.913756 -1.838941 0.289823
H  5.176168 -0.573544 0.290896
H  -1.79467 0.453767 1.40178
H  -3.945502 0.862546 0.009559
H  -3.17533 0.046916 -1.370212
H  -4.779024 -1.496005 -0.141425
H  -3.103084 -2.121899 -0.041538
H  -3.832679 -1.292831 1.361934
