program: Gaussian 09
title: 000032931
version: EM64L-G09RevD.01
frameworkgroup: C1[X(C6H3Br3O)]
method: RPBEPBE
basis: SDD
operation: Freq
keyword: #p
keyword: freq=noraman
keyword: PBEPBE/SDD
title: #p freq=noraman PBEPBE/SDD
converged: NO YES NO YES
title: Mulliken charges:
elementType: Br Br Br O C C C C C C H H H
charge: 0.047480 0.075871 0.072751 -0.398929 0.428204 -0.408462 -0.279606 -0.135015 -0.129021 -0.199365 0.289136 0.277464 0.359491
chargesum: 0.00000
title: Mulliken charges with hydrogens summed into heavy atoms:
elementType: Br Br Br O C C C C C C
charge: 0.047480 0.075871 0.072751 -0.039438 0.428204 -0.408462 0.009530 -0.135015 0.148443 -0.199365
polarizability: 1.87524209e+02 -2.98909065e+00 1.21074729e+02 1.52062430e-02 -4.24330123e-03 3.92093365e+01
1716.lowfreq: -6.8612 -0.0005 -0.0004 -0.0002 3.6713 6.1033 55.1142 118.1252 119.6970
frequency: 55.1131 118.1245 119.6958 132.7636 203.3253 209.5768 238.1344 292.3121 335.0846 415.0354 433.7993 443.8612 503.5168 600.5296 606.9941 676.4307 679.3308 854.0625 854.5706 877.9850 1005.7316 1094.4879 1161.6598 1225.7495 1242.1247 1362.8452 1371.8645 1436.4686 1551.6472 1584.3795 3181.0568 3186.1055 3493.5612
redmass: 15.1336 57.8182 8.6931 30.5729 63.3019 5.2309 8.3039 13.8383 11.8074 9.3310 1.3944 1.9086 4.5191 10.4041 8.7751 8.2657 3.4322 1.4907 9.0678 1.4196 6.3424 2.0580 1.3859 3.0729 1.4787 7.9611 3.3779 3.3781 7.9031 7.5547 1.0926 1.0929 1.0650
irintensity: 0.0002 0.1865 0.1357 0.0815 0.0849 0.5658 5.0107 0.0398 1.1819 9.9523 150.1773 15.3024 23.8996 0.0371 43.8935 9.9860 0.7655 0.0020 27.7893 38.4309 87.3564 22.2411 266.4405 4.6696 19.0589 36.4875 23.1705 198.4646 20.7941 15.8287 0.6702 0.7182 72.2388
temp: 298.150 k
press: 1.00000 atm
elementType: 35 35 35 8 6 6 6 6 6 6 1 1 1
symmnumber: 1
zpe: 188698.5 jmol-1
zpe.correction: 0.071871 hartree
zpe.thermalcorrener: 0.081964 hartree
zpe.thermalcorrenthalpy: 0.082908 hartree
zpe.thermalcorrgfe: 0.033067 hartree
zpe.sumelectzpe: -345.310217 hartree
zpe.sumelectthermal: -345.300124 hartree
zpe.sumelectthermalent: -345.299180 hartree
zpe.sumelectthermalfe: -345.349021 hartree
dipole: 2.0070 0.1480 0.0000
dipole: 2.0124
quadrupole: -78.8879 -84.4700 -88.4903
quadrupole: 0.0290 0.0003 0.0003
quadrupole: 5.0615 -0.5206 -4.5409 0.0290 0.0003 0.0003
hfenergy: -345.3820883 hartree
pointgroup: C01 [X(C6H3Br3O1)]
dipole: -0.7640787 -0.2074797 0.0000031 debye
dipolederiv: -0.5821352 -0.1865363 0.0000588 -0.2374207 -0.2077872 0.0000238 0.000055 0.0000152 0.0083393 -0.4628742 -0.2777646 0.000046 -0.3085007 -0.1630376 0.0000295 0.0000444 0.000025 0.0131211 -0.3831501 0.2668781 0.0000469 0.3277765 -0.221342 -0.0000392 0.0000426 -0.0000297 0.015677 -1.1087408 0.5382254 0.0001308 0.6126991 -0.5429108 -0.0000428 0.0001632 -0.00007 -0.3959549 0.746874 -0.744572 -0.000122 -0.6052166 0.4110948 0.000074 -0.0001351 0.0001049 0.1255057 0.822063 0.3994078 -0.0000944 0.7136825 0.0673577 -0.0000741 -0.0000654 -0.0000414 -0.1756531 -0.4074497 0.1361405 0.0000444 -0.21485 -0.1240506 0.0000242 0.0000208 -0.000013 -0.098712 0.7515442 0.6464833 -0.0000826 0.5506962 0.3815683 -0.0000448 -0.0000877 -0.0000503 -0.0840311 -0.2456511 0.1796315 0.0000257 -0.1229165 -0.1517924 0.000012 0.0000174 -0.0000201 0.0094015 0.3801161 -0.8220266 -0.0000629 -0.5773344 0.1880093 0.000064 -0.0000489 0.0000841 -0.1298548 0.0643583 -0.0025347 0.0000131 -0.0044701 0.0221286 -0.0000027 0.0000176 -0.0000043 0.1771576 0.0881128 -0.0245606 0.0000077 -0.0107271 0.0123718 -0.0000036 0.0000042 -0.0000015 0.1613643 0.3369327 -0.1087717 -0.0000115 -0.1234181 0.3283899 -0.0000202 -0.0000281 0.0000012 0.3736394 unknown
polarizability: 186.2333025|9.6461533|122.3656356|-0.015736|0.0012709|39.2093365 unknown
InChI: InChI=1S/C6H3Br3O/c7-3-1-5(9)6(10)2-4(3)8/h1-2,10H
charge 0 multiplicity 1
13 atoms
Br -3.059702 -1.448874 0.000371
Br 2.942759 1.565304 -0.00021
Br 2.712014 -1.92921 -0.000254
O  -2.319027 1.656779 0.000438
C  -1.213053 0.814997 0.000246
C  -1.290957 -0.601701 0.000205
C  0.062768 1.423211 0.000113
C  1.230585 0.636597 -0.000045
C  -0.130611 -1.394916 0.000045
C  1.140745 -0.777652 -0.000076
H  0.114945 2.514328 0.000134
H  -0.206848 -2.484723 0.000018
H  -3.161919 1.12916 0.000413
