program: Gaussian 09
title: 000032930
version: EM64L-G09RevD.01
frameworkgroup: C1[X(C6H3Br3O)]
method: RPBEPBE
basis: SDD
operation: Freq
keyword: #p
keyword: freq=noraman
keyword: PBEPBE/SDD
title: #p freq=noraman PBEPBE/SDD
converged: NO NO NO NO
title: Mulliken charges:
elementType: Br Br Br O C C C C C C H H H
charge: 0.101559 0.076835 0.038576 -0.410150 0.478084 -0.365520 -0.344943 -0.120924 -0.195799 -0.160653 0.253179 0.280381 0.369373
chargesum: 0.00000
title: Mulliken charges with hydrogens summed into heavy atoms:
elementType: Br Br Br O C C C C C C
charge: 0.101559 0.076835 0.038576 -0.040777 0.478084 -0.365520 -0.091763 -0.120924 0.084582 -0.160653
polarizability: 1.83285915e+02 1.49634637e+00 1.26786910e+02 9.71872705e-03 3.84093698e-03 3.94209461e+01
1716.lowfreq: 0.0004 0.0004 0.0005 3.7854 7.7351 8.3010 57.3029 119.2754 123.7248
frequency: 57.2974 119.2752 123.7241 133.7925 204.1728 208.2989 240.2335 284.7277 286.1863 356.0630 425.0582 513.1514 521.1020 540.3782 564.9262 701.9465 732.3723 831.4616 855.9586 877.0148 1003.9972 1106.7792 1123.0519 1201.3206 1256.1544 1360.6523 1376.1085 1437.2534 1548.4192 1577.6666 3141.7641 3185.4048 3584.8426
redmass: 13.6678 41.2639 8.6272 34.7037 53.5224 4.8557 7.6110 4.6829 15.4038 1.2140 8.5992 4.6985 4.8143 8.6814 4.7177 4.1715 10.2720 1.5413 1.4003 10.7405 7.6996 1.8139 1.7189 1.6635 1.9946 7.8415 3.7424 3.0079 7.0321 7.2085 1.0926 1.0932 1.0662
irintensity: 0.2332 0.0979 0.5194 0.0447 0.0766 0.5310 6.6523 24.2768 0.4427 122.6402 9.4607 14.2183 6.3272 9.2479 10.3581 6.4180 41.7245 33.0051 20.9560 113.9943 39.3758 55.4299 123.4255 114.0323 13.1100 31.0925 72.4134 62.0437 67.0969 122.7944 2.7023 0.9124 55.5956
temp: 298.150 k
press: 1.00000 atm
elementType: 35 35 35 8 6 6 6 6 6 6 1 1 1
symmnumber: 1
zpe: 188295.5 jmol-1
zpe.correction: 0.071718 hartree
zpe.thermalcorrener: 0.081899 hartree
zpe.thermalcorrenthalpy: 0.082844 hartree
zpe.thermalcorrgfe: 0.032871 hartree
zpe.sumelectzpe: -345.305222 hartree
zpe.sumelectthermal: -345.295041 hartree
zpe.sumelectthermalent: -345.294097 hartree
zpe.sumelectthermalfe: -345.344069 hartree
dipole: 1.9106 1.8719 0.0001
dipole: 2.6748
quadrupole: -87.2227 -73.1163 -88.5194
quadrupole: 6.2275 0.0006 0.0013
quadrupole: -4.2699 9.8366 -5.5666 6.2275 0.0006 0.0013
hfenergy: -345.3769401 hartree
pointgroup: C01 [X(C6H3Br3O1)]
dipole: 0.6991225 -0.7865383 -0.0000479 debye
dipolederiv: -0.5630261 -0.1289825 0.0000318 -0.0928552 0.0507015 0.0000637 0.0000857 0.0000383 0.0363431 -0.1746484 0.2575934 0.0000083 0.3043934 -0.4440468 -0.0000405 0.0000417 -0.0000358 0.0115944 -0.7377702 -0.0327336 0.0000315 -0.0451166 -0.0624873 -0.0000156 0.0001356 0.0000353 -0.014141 -0.2101293 -0.4513048 -0.0000317 -0.390534 -1.2849017 -0.0000645 -0.0000394 -0.0000638 -0.3983282 0.0454643 0.3351748 0.0000297 0.1949815 1.2599392 0.0000876 0.0001008 0.0001068 0.1507046 0.9000075 0.5174095 -0.0000417 0.0132133 -0.5402427 -0.0001126 -0.0001932 -0.0001013 -0.1373694 -0.4561366 -0.3714215 0.0000079 0.0981357 -0.2540078 -0.0000333 -0.0000551 -0.000022 -0.1564204 0.3312343 -0.6188035 -0.0000528 -0.2488795 0.9069579 0.0000985 0.0000386 0.0001046 -0.062029 -0.6976326 0.2135047 0.0000508 0.1396496 -0.3398461 -0.0000147 -0.000096 -0.0000752 -0.0804607 1.3386218 0.1222167 -0.0000557 -0.1012739 0.3259371 0.0000557 -0.0000628 0.0000352 -0.0959241 0.0449412 0.0432511 0.0000118 0.0480842 -0.0354428 -0.0000149 0.0000081 -0.0000226 0.1821601 0.064377 -0.0373044 0.000002 -0.0298328 0.0299933 -0.0000143 0.000025 0. 0.1728421 0.1146971 0.1514 0.0000081 0.1100344 0.3874462 0.0000049 0.0000112 0.0000005 0.3910286 unknown
polarizability: 182.8112755|-5.3693996|127.2615497|-0.0094307|0.0045021|39.4209461 unknown
InChI: InChI=1S/C6H3Br3O/c7-3-1-4(8)6(9)5(10)2-3/h1-2,10H
charge 0 multiplicity 1
13 atoms
Br -3.025049 -0.401148 0.000051
Br -1.567001 2.761604 0.000159
Br 3.653366 0.308252 -0.000041
O  -0.8943 -2.543917 -0.000217
C  -0.269972 -1.299656 -0.000148
C  -1.102102 -0.147179 -0.000051
C  1.141652 -1.165912 -0.000165
C  -0.498929 1.132462 0.000023
C  0.90757 1.281882 0.000035
C  1.708353 0.122176 -0.00006
H  1.779809 -2.057136 -0.000242
H  1.356723 2.277388 0.000127
H  -0.233821 -3.280516 -0.000271
