program: Gaussian 09
title: 000032940
version: EM64L-G09RevD.01
frameworkgroup: C1[X(C15H14ClN3O)]
method: RPBEPBE
basis: SDD
operation: Freq
keyword: #p
keyword: freq=noraman
keyword: PBEPBE/SDD
title: #p freq=noraman PBEPBE/SDD
converged: YES YES NO NO
title: Mulliken charges:
elementType: Cl O N N N C C C C C C C C C C C C C C C H H H H H H H H H H H H H H
charge: -0.069735 -0.450839 -0.435161 -0.089685 -0.114275 -0.041029 0.162734 0.322558 -0.405211 0.198009 -0.488710 -0.323816 -0.373890 -0.280585 -0.244870 -0.212904 -0.195244 -0.110673 -0.357298 -0.173088 0.229932 0.217668 0.344990 0.228558 0.233473 0.261570 0.295911 0.367487 0.271687 0.253227 0.253166 0.245117 0.244362 0.236567
chargesum: 0.00000
title: Mulliken charges with hydrogens summed into heavy atoms:
elementType: Cl O N N N C C C C C C C C C C C C C C C
charge: -0.069735 -0.083352 -0.090171 -0.089685 -0.114275 -0.041029 0.162734 0.322558 0.042389 0.198009 -0.026680 -0.062245 -0.077979 -0.008898 0.008357 0.040261 0.049873 -0.110673 -0.112937 0.063479
polarizability: 2.52789937e+02 2.22053821e-01 1.81443122e+02 2.88528999e+00 -9.56382199e-01 1.37736817e+02
1716.lowfreq: -8.7116 -7.0488 -4.9831 -0.0015 -0.0012 0.0011 25.6267 35.5294 53.5299
frequency: 25.5588 35.5216 53.4945 57.8244 80.4078 109.5239 139.1476 158.7553 164.0082 192.1682 240.9861 251.6328 284.0429 294.6824 308.7615 322.1482 347.1124 372.9176 403.7924 409.3899 450.7992 477.5641 504.3058 547.5475 619.1528 624.2683 644.5930 685.2356 689.2791 696.2392 720.0947 752.6179 787.6349 801.7868 813.3082 825.5004 834.8929 857.9055 902.4150 909.7766 910.0692 937.8597 950.6531 955.4543 966.9349 976.4898 981.0973 1002.8738 1007.0435 1018.5151 1033.5573 1046.6077 1072.0180 1078.1888 1093.2343 1112.9319 1166.0189 1170.7178 1171.7044 1186.8949 1203.7674 1212.8461 1219.4772 1276.6500 1289.2639 1294.8056 1297.1378 1314.4583 1346.8503 1374.7271 1389.1680 1413.9327 1417.3876 1448.9050 1467.6278 1477.7196 1498.3049 1566.2635 1579.7944 1585.7831 1594.1624 1601.7182 2975.4784 3006.6576 3044.1365 3068.1408 3133.4384 3146.4740 3155.9793 3162.2584 3171.8454 3175.4296 3185.3854 3187.9266 3303.7764 3504.6143
redmass: 4.6841 5.9968 3.8552 4.5289 4.6839 3.5702 6.2729 4.2572 2.9074 5.8956 5.7220 2.8991 5.7094 5.0662 5.0553 3.1557 5.5421 2.1818 3.3231 2.9691 6.9719 4.9515 3.3609 3.6912 6.3681 7.1272 4.1657 4.0778 3.7568 5.9090 4.3675 1.7918 1.7661 3.2734 1.6751 1.5442 1.3446 2.5330 3.1997 3.0207 1.6236 4.3011 1.6610 3.3478 1.5168 6.1225 1.3741 4.1376 1.3664 3.4769 3.2184 2.4754 2.6311 1.7327 1.6459 1.3451 1.3117 1.5181 1.2034 1.2037 3.6114 1.1004 2.1461 1.4538 1.3744 1.2883 1.3340 5.9464 1.9993 5.4187 3.1490 1.9991 1.8948 2.1526 1.0995 2.4960 1.0983 5.8408 5.8077 7.2420 7.4812 6.2184 1.0641 1.0637 1.0985 1.1053 1.0887 1.0905 1.0885 1.0901 1.0972 1.0969 1.0974 1.0953 1.0800 1.0658
irintensity: 0.4543 0.6831 3.0936 0.4388 1.4804 3.5418 0.4214 4.1378 11.4612 1.3757 0.7032 22.9083 25.9932 6.8554 4.2919 28.9193 0.9723 78.2563 5.8935 0.0666 31.0425 15.5103 13.8421 5.2849 12.4407 0.3546 23.6629 32.8490 30.2293 9.6336 7.6473 38.9371 19.9695 31.1102 80.3401 7.0593 26.0721 71.0805 34.7730 6.1249 3.0278 46.1568 10.4532 5.4196 0.5593 9.7079 2.5451 41.1685 0.3058 13.8173 3.7576 1.5609 32.2068 5.0902 13.2963 3.6029 7.4571 37.6496 16.5066 1.6212 24.8086 2.5486 48.5212 43.4345 17.2233 2.7744 12.0361 2.4288 49.7618 16.0153 21.6591 62.7187 74.9081 43.4127 0.4117 81.2420 7.1281 7.2113 77.5364 19.0965 37.8150 13.3795 70.5776 55.4993 33.8221 44.9873 13.2950 9.5804 4.2859 2.5829 24.8440 3.8508 7.4295 1.8668 314.2692 36.9312
temp: 298.150 k
press: 1.00000 atm
elementType: 17 8 7 7 7 6 6 6 6 6 6 6 6 6 6 6 6 6 6 6 1 1 1 1 1 1 1 1 1 1 1 1 1 1
symmnumber: 1
zpe: 683833.0 jmol-1
zpe.correction: 0.260458 hartree
zpe.thermalcorrener: 0.277906 hartree
zpe.thermalcorrenthalpy: 0.278850 hartree
zpe.thermalcorrgfe: 0.213503 hartree
zpe.sumelectzpe: -1278.085397 hartree
zpe.sumelectthermal: -1278.067950 hartree
zpe.sumelectthermalent: -1278.067006 hartree
zpe.sumelectthermalfe: -1278.132352 hartree
dipole: 5.5889 2.3612 -1.4138
dipole: 6.2297
quadrupole: -120.6587 -109.6601 -121.3080
quadrupole: -1.4592 -4.1278 -2.6309
quadrupole: -3.4497 7.5488 -4.0991 -1.4592 -4.1278 -2.6309
hfenergy: -1278.3458554 hartree
pointgroup: C01 [X(C15H14Cl1N3O1)]
dipole: -2.2888753 0.652468 0.5853059 debye
polarizability: 251.3920524|9.936746|182.7217296|-2.2776408|-2.9169396|137.8560939 unknown
InChI: InChI=1S/C15H14ClN3O/c16-12-6-4-11(5-7-12)15(20,14-18-9-10-19-14)13-3-1-2-8-17-13/h1-8,18,20H,9-10H2
charge 0 multiplicity 1
34 atoms
Cl 5.55019 0.925252 -0.02844
O  -0.726331 -0.509308 -2.105823
N  -2.226346 -2.054244 -0.183788
N  -0.128432 -2.433658 0.742779
N  -2.685587 0.670739 -0.194073
C  -0.457901 -0.332435 -0.651922
C  -0.900124 -1.626881 0.0493
C  1.037981 -0.056989 -0.493861
C  -2.446867 -3.289197 0.616586
C  -1.328307 0.880421 -0.206844
C  -0.983306 -3.620484 1.099653
C  1.628546 0.009636 0.79212
C  1.840031 0.17415 -1.634486
C  -0.779818 2.15704 0.060997
C  2.999614 0.307417 0.94182
C  3.216467 0.47135 -1.502948
C  -1.647031 3.236553 0.339653
C  3.772377 0.536385 -0.213266
C  -3.51312 1.715017 0.07968
C  -3.041816 3.018636 0.350658
H  -2.879071 -4.096966 0.001513
H  -3.129753 -3.092424 1.466984
H  -2.926167 -1.291277 -0.240517
H  -0.922317 -3.812755 2.18493
H  -0.575893 -4.506836 0.579168
H  1.027858 -0.197718 1.682075
H  1.382391 0.107821 -2.624122
H  -1.533063 -1.086502 -2.179939
H  0.302245 2.302241 0.043809
H  3.457308 0.348834 1.934257
H  3.837293 0.645978 -2.386267
H  -1.237498 4.231624 0.542793
H  -4.5864 1.49438 0.077815
H  -3.746953 3.828401 0.560403
