program: Gaussian 09
title: 000032971
version: EM64L-G09RevD.01
frameworkgroup: C1[X(C14H6Cl2N4O5)]
method: RPBEPBE
basis: SDD
operation: Freq
keyword: #p
keyword: freq=noraman
keyword: PBEPBE/SDD
title: #p freq=noraman PBEPBE/SDD
converged: YES YES NO NO
title: Mulliken charges:
elementType: Cl Cl O O O O O N N N N C C C C C C C C C C C C C C H H H H H H
charge: 0.067105 0.067112 -0.264589 -0.189792 -0.189795 -0.169966 -0.169966 -0.104923 -0.104806 0.020864 0.020867 0.370459 0.370538 0.117076 0.116980 -0.480705 -0.480728 -0.377066 -0.377060 0.502464 0.502418 -0.173303 -0.173281 -0.322610 -0.322604 0.333397 0.333386 0.267924 0.267951 0.271329 0.271323
chargesum: 0.00000
title: Mulliken charges with hydrogens summed into heavy atoms:
elementType: Cl Cl O O O O O N N N N C C C C C C C C C C C C C C
charge: 0.067105 0.067112 -0.264589 -0.189792 -0.189795 -0.169966 -0.169966 -0.104923 -0.104806 0.020864 0.020867 0.370459 0.370538 0.117076 0.116980 -0.147308 -0.147343 -0.109142 -0.109109 0.502464 0.502418 0.098026 0.098042 -0.322610 -0.322604
polarizability: 4.85771950e+02 5.31776156e-03 2.36043531e+02 -4.88856234e-02 -1.71761387e-02 7.88740863e+01
1716.lowfreq: -43.0356 -42.8192 -7.1085 -5.2464 -1.2258 -0.0012 -0.0009 -0.0001 15.0018
frequency: -43.0160 -42.8184 14.9840 19.7460 32.0974 63.4934 64.4514 98.8817 125.5932 133.8597 136.2717 177.5921 214.0377 223.0089 232.2451 252.6201 292.6507 310.9614 322.4763 331.2567 355.3917 374.4678 421.4198 431.9048 432.2610 469.1435 475.7260 509.6339 532.4880 542.0229 567.2165 600.0474 652.9110 653.0763 654.1940 666.9501 700.2296 717.5322 722.4994 724.4159 727.4720 727.4823 818.5901 827.5512 840.2505 843.5744 886.0728 897.6551 961.9581 967.2722 969.7459 981.8490 982.9087 1007.3749 1023.1285 1024.3969 1080.2800 1102.5065 1103.1372 1149.0312 1151.7107 1190.8603 1193.6784 1200.4129 1247.3243 1252.7271 1268.9959 1362.7307 1370.4534 1378.2851 1378.4386 1413.8349 1415.1617 1430.4811 1436.7427 1517.8538 1530.4228 1562.4634 1566.8412 1614.0467 1614.8224 3164.5190 3164.7447 3176.7898 3176.9224 3183.1867 3183.3509
redmass: 16.2711 16.2840 10.0989 12.9859 12.1733 9.1883 12.5346 10.0423 6.6324 5.3357 13.4170 7.9766 19.9910 19.2692 8.8373 14.2351 11.0395 14.5994 6.9836 13.8417 13.1715 7.4604 8.6376 3.5575 3.5918 10.4129 7.3879 7.4969 5.0913 5.1407 7.6438 7.4171 7.8768 7.8733 9.8618 7.4301 4.9471 10.4961 5.3686 11.2189 5.5596 5.6896 9.9811 9.8846 1.3824 1.4003 13.9239 13.4167 10.5096 1.4712 1.4845 1.3615 1.3591 8.0698 6.7764 5.2963 4.2198 2.1561 2.4097 1.6438 1.5195 11.0960 14.1135 3.4084 1.5725 1.3992 2.9812 4.0177 4.7890 9.5919 9.6318 4.5262 4.5899 3.5479 3.2002 7.5405 8.6662 8.2862 8.3695 6.7072 6.6801 1.0890 1.0890 1.0922 1.0922 1.0978 1.0978
irintensity: 0.0648 0.0000 0.0000 1.0081 0.6162 0.0008 2.5582 0.1279 0.4778 0.0000 0.4273 2.3010 0.4341 0.0819 0.0000 1.7475 0.6412 7.7530 1.1262 0.2699 0.3942 0.0000 2.3721 1.8471 0.0032 0.7241 5.4059 27.4887 27.9566 0.0002 4.2165 23.3010 4.4561 17.3369 0.0010 12.5779 0.0000 32.4447 18.1207 27.5933 5.4550 0.7665 11.1852 12.4212 0.0007 58.7479 7.0881 30.7464 2.3456 0.0053 36.7966 0.0033 6.6264 67.6672 20.1357 75.5952 0.4133 3.1908 47.5652 3.0818 5.5953 231.1420 255.8457 46.9031 0.0380 59.3977 0.0166 1.4881 2.0233 67.2979 25.4733 30.4194 7.1711 362.1210 94.0989 0.9155 7.2872 2.9501 21.3874 4.6494 71.3306 1.5480 0.0671 3.4500 26.7092 0.3519 3.7903
temp: 298.150 k
press: 1.00000 atm
elementType: 17 17 8 8 8 8 8 7 7 7 7 6 6 6 6 6 6 6 6 6 6 6 6 6 6 1 1 1 1 1 1
symmnumber: 1
zpe: 486400.4 jmol-1
zpe.correction: 0.185260 hartree
zpe.thermalcorrener: 0.204543 hartree
zpe.thermalcorrenthalpy: 0.205487 hartree
zpe.thermalcorrgfe: 0.133943 hartree
zpe.sumelectzpe: -2050.379846 hartree
zpe.sumelectthermal: -2050.360564 hartree
zpe.sumelectthermalent: -2050.359619 hartree
zpe.sumelectthermalfe: -2050.431163 hartree
dipole: -0.0003 8.9625 -0.0007
dipole: 8.9625
quadrupole: -218.8861 -162.3714 -153.5424
quadrupole: 0.0022 0.0074 0.0012
quadrupole: -40.6195 15.8953 24.7242 0.0022 0.0074 0.0012
hfenergy: -2050.5651063 hartree
pointgroup: C01 [X(C14H6Cl2N4O5)]
dipole: -0.0004833 3.5261325 -0.0002833 debye
polarizability: 485.7719458|0.0323076|236.0435347|-0.0488838|-0.0171814|78.8740863 unknown
InChI: InChI=1S/C14H6Cl2N4O5/c15-9-3-1-7(5-11(9)19(21)22)13-17-18-14(25-13)8-2-4-10(16)12(6-8)20(23)24/h1-6H
charge 0 multiplicity 1
31 atoms
Cl 6.74782 1.962368 -0.000317
Cl -6.748633 1.961076 -0.000381
O  -0.000315 0.543683 -0.000088
O  5.573427 -2.488806 0.002527
O  -5.573649 -2.489972 -0.002362
O  7.182374 -0.8820 -0.002592
O  -7.182878 -0.883463 0.002371
N  0.714815 -1.62596 0.000297
N  -0.714711 -1.626121 0.000306
N  5.953503 -1.255147 -0.000416
N  -5.953933 -1.256382 0.000441
C  2.459425 0.192756 -0.000167
C  -2.460076 0.192035 0.000094
C  1.106495 -0.344954 0.0000
C  -1.107063 -0.345569 0.00014
C  3.554283 -0.701044 -0.000072
C  -3.55476 -0.701974 0.000122
C  2.70238 1.592476 -0.000405
C  -2.703128 1.591731 0.000026
C  4.877445 -0.212973 -0.000313
C  -4.878009 -0.214036 0.000183
C  4.020093 2.075588 -0.000514
C  -4.020951 2.074642 -0.000049
C  5.121455 1.18793 -0.000533
C  -5.1222 1.186837 0.000093
H  3.394015 -1.782961 0.00018
H  -3.394403 -1.783871 0.000105
H  1.863391 2.293981 -0.00045
H  -1.864265 2.293357 -0.000024
H  4.21324 3.151775 -0.000573
H  -4.214285 3.150799 -0.000228
