program: Gaussian 09
title: 000003076
version: EM64L-G09RevD.01
frameworkgroup: C1[X(C22H26N2O4S)]
method: RPBEPBE
basis: SDD
operation: Freq
keyword: #p
keyword: freq=noraman
keyword: PBEPBE/SDD
title: #p freq=noraman PBEPBE/SDD
converged: YES YES NO NO
title: Mulliken charges:
elementType: S O O O O N N C C C C C C C C C C C C C C C C C C C C C C H H H H H H H H H H H H H H H H H H H H H H H H H H
charge: 0.213301 -0.266569 -0.256205 -0.263729 -0.220768 -0.236621 -0.083766 -0.668075 -0.135806 0.198311 -0.393167 0.554741 0.542061 -0.357634 -0.359302 -0.376762 -0.236044 -0.395780 -0.396097 -0.235215 -0.246295 -0.375670 -0.360613 -0.620800 -0.618162 0.319651 0.299232 -0.766660 -0.538492 0.315357 0.290125 0.216813 0.265588 0.199563 0.258289 0.251024 0.256552 0.299532 0.235904 0.234213 0.234292 0.243319 0.251052 0.235996 0.219794 0.189521 0.217599 0.225716 0.193235 0.248621 0.245275 0.261244 0.245137 0.223568 0.223603
chargesum: 0.00000
title: Mulliken charges with hydrogens summed into heavy atoms:
elementType: S O O O O N N C C C C C C C C C C C C C C C C C C C C C C
charge: 0.213301 -0.266569 -0.256205 -0.263729 -0.220768 -0.236621 -0.083766 -0.352717 0.154320 0.198311 0.089234 0.554741 0.542061 -0.357634 0.098550 -0.125737 0.020508 -0.096248 -0.160193 -0.001002 -0.012003 -0.132351 -0.109561 0.024511 0.018389 0.319651 0.299232 -0.011520 0.153815
polarizability: 3.85003659e+02 4.57478473e+01 2.60398681e+02 1.24425827e+01 3.65496035e+01 2.34396914e+02
1716.lowfreq: -10.6399 -7.5989 -2.8404 -0.0012 -0.0008 -0.0004 15.0984 23.1202 25.6302
frequency: 14.3933 23.0402 25.4542 32.6505 35.3840 44.7724 53.9608 60.9794 70.7823 84.2271 91.3525 94.0409 104.7725 127.1517 131.7307 157.2520 160.3834 176.2016 189.4882 212.3520 215.5804 222.1255 234.0489 241.4601 265.0686 266.8285 281.8290 291.9574 337.5711 351.5971 362.5769 375.2884 386.3893 413.7702 415.5789 423.7446 433.8330 459.6259 469.5175 492.3457 510.8575 513.8274 534.2033 543.0531 554.5360 569.7362 618.0349 627.3930 632.8577 652.4618 685.8952 708.9856 725.1213 738.6405 748.8353 766.6485 773.3088 783.0505 813.4285 826.1009 828.3350 841.2194 873.6226 886.0891 911.7824 951.8995 953.3027 958.6224 980.2497 986.5105 986.8660 992.2617 1004.8682 1008.2989 1024.8150 1029.4552 1035.8827 1040.8356 1042.0244 1056.1645 1069.1482 1078.6781 1090.7786 1112.9640 1117.8447 1127.0413 1137.8070 1151.3145 1157.4953 1171.7027 1176.6532 1188.2220 1192.7130 1203.2900 1238.0101 1243.8385 1255.9141 1265.6298 1270.1390 1273.3835 1290.2153 1296.5889 1314.6983 1322.6582 1332.9996 1361.0927 1370.7562 1378.1693 1383.0954 1388.5494 1419.8565 1427.0500 1429.3953 1437.8479 1438.8322 1448.7373 1453.2557 1454.1873 1459.7775 1461.4467 1467.9218 1468.4594 1473.7533 1474.7140 1480.0703 1486.6799 1504.5920 1569.3088 1574.7743 1581.5660 1597.0244 1622.6955 1658.1001 2852.0783 2861.5749 2885.4095 2962.3670 3005.8890 3018.2163 3019.9091 3044.5739 3044.9870 3051.2056 3055.1105 3064.7379 3074.8175 3081.9091 3093.5876 3116.9264 3125.4845 3126.2322 3129.5896 3130.2647 3141.9010 3141.9504 3153.3244 3163.2907 3168.4221 3169.2844
redmass: 3.9622 3.5350 3.3903 4.3284 5.5953 5.5834 5.2734 4.1689 2.8582 2.8514 2.6067 1.4559 3.9333 7.1471 4.4909 4.1856 4.1763 3.5537 5.4920 1.5723 1.6287 7.0444 1.3781 1.3806 3.9175 3.4230 4.4328 4.8540 2.8864 4.5503 3.7742 5.6620 3.3066 2.9928 3.0106 4.8741 4.7142 3.5741 4.2427 4.2610 4.9127 5.3962 3.6249 4.8201 3.6179 3.4985 5.3688 5.8744 6.1660 6.1410 5.8993 5.5541 4.5163 3.2380 4.1679 1.3900 1.5849 3.5385 6.1000 1.2491 3.4869 1.7856 1.4399 4.9149 3.6546 1.4739 3.6232 1.3891 1.3590 2.8679 1.9272 2.2713 2.7282 4.1611 3.8251 3.0333 1.5373 2.1308 1.6888 2.7437 2.0970 2.6678 1.3334 1.2602 1.4035 1.6139 1.4671 1.2878 1.3347 1.0595 1.7418 1.7006 2.1948 1.7733 2.7092 1.8070 2.1771 1.7104 1.9229 2.1049 1.7286 1.2181 1.3121 1.3539 1.5334 5.1502 2.4703 1.5862 1.2636 3.6942 1.1495 2.9603 2.3699 1.1672 1.1438 1.1642 1.0559 1.0544 1.6083 1.3672 1.0497 1.0607 1.0754 1.0569 1.0919 1.0538 2.4217 6.6680 7.0995 6.8364 6.6694 6.0269 9.6927 1.0566 1.0583 1.0691 1.0328 1.0367 1.0728 1.0732 1.0843 1.0610 1.1040 1.0854 1.0893 1.1001 1.0999 1.0972 1.1053 1.0899 1.0994 1.0922 1.0857 1.0899 1.1006 1.0947 1.0932 1.0953 1.1006
irintensity: 0.1967 0.3988 0.0716 1.2904 1.9872 0.7498 3.5080 1.8349 0.5833 0.7606 1.6762 0.6525 1.1094 3.0676 1.4763 4.0048 4.4864 0.5949 1.7186 1.5479 0.9399 2.9340 0.3996 0.8712 2.2454 3.3152 0.1470 4.9522 4.5130 4.3272 11.2948 0.0555 4.7115 1.1743 1.8926 7.0502 0.6854 2.5113 16.1673 27.4896 0.7217 20.7397 38.5286 17.2090 2.1921 13.7398 4.4925 3.7200 15.4997 0.6815 1.9609 3.3280 5.6131 3.1226 3.5504 65.4256 19.0451 10.8488 13.0603 0.0811 23.7456 52.4194 1.2788 27.1684 6.8287 1.6081 38.5215 4.2965 1.2439 21.8261 18.3990 114.8522 6.4349 7.6887 22.0653 11.7941 20.9667 8.3292 8.9390 56.4930 30.1212 13.4509 11.5466 0.2204 12.0529 7.6310 5.1618 10.5674 2.5149 0.6199 24.9493 301.9117 158.0329 17.9391 114.4864 8.0967 43.3481 1.3911 30.3776 98.0501 14.3099 9.4531 1.2564 3.3786 2.2643 18.7826 22.5554 24.5529 66.5950 9.8381 3.8958 4.8398 14.4618 12.0954 0.3599 9.0992 14.8809 15.1697 78.2902 16.0475 13.5609 3.9212 63.7873 31.4409 15.0744 9.8561 144.1816 97.8105 95.7100 18.3337 30.5456 117.4614 161.6187 61.9243 156.2991 102.6267 70.5491 2.7957 25.5748 61.8887 4.3907 23.5546 45.2754 4.9976 2.7625 38.1601 45.4861 5.0540 8.1643 12.2808 22.6155 15.2251 1.4101 7.1009 7.9796 14.5170 15.9651 11.9168 24.1961
temp: 298.150 k
press: 1.00000 atm
elementType: 16 8 8 8 8 7 7 6 6 6 6 6 6 6 6 6 6 6 6 6 6 6 6 6 6 6 6 6 6 1 1 1 1 1 1 1 1 1 1 1 1 1 1 1 1 1 1 1 1 1 1 1 1 1 1
symmnumber: 1
zpe: 1151918.1 jmol-1
zpe.correction: 0.438742 hartree
zpe.thermalcorrener: 0.468243 hartree
zpe.thermalcorrenthalpy: 0.469188 hartree
zpe.thermalcorrgfe: 0.375120 hartree
zpe.sumelectzpe: -1660.230909 hartree
zpe.sumelectthermal: -1660.201408 hartree
zpe.sumelectthermalent: -1660.200464 hartree
zpe.sumelectthermalfe: -1660.294532 hartree
dipole: -1.7246 -1.2880 -2.2765
dipole: 3.1330
quadrupole: -151.2087 -157.9234 -191.3152
quadrupole: 14.3899 10.2268 3.1024
quadrupole: 15.6070 8.8924 -24.4994 14.3899 10.2268 3.1024
hfenergy: -1660.6696515 hartree
pointgroup: C01 [X(C22H26N2O4S1)]
dipole: 0.6298742 0.6794002 -0.8130157 debye
polarizability: 370.0649422|62.531491|282.1903238|3.4648991|-31.1787184|227.5439878 unknown
InChI: InChI=1S/C22H26N2O4S/c1-15(25)28-20-21(16-9-11-17(27-4)12-10-16)29-19-8-6-5-7-18(19)24(22(20)26)14-13-23(2)3/h5-12,20-21H,13-14H2,1-4H3
charge 0 multiplicity 1
55 atoms
S  -0.049702 0.397653 -1.789526
O  0.248316 2.287074 1.157186
O  0.184595 -1.296279 1.701563
O  -6.268361 -1.594628 -0.79316
O  0.723933 1.804823 3.390965
N  1.881987 -0.089867 0.660546
N  3.725403 -3.380791 0.115444
C  -1.174664 1.037453 -0.328823
C  -0.408013 0.954378 1.011809
C  0.579054 -0.234197 1.130179
C  2.817606 -1.219311 0.940662
C  2.29897 0.936692 -0.257621
C  -2.493067 0.30027 -0.39926
C  1.522359 1.27336 -1.404774
C  2.66882 -2.366028 -0.090753
C  3.535739 1.597447 -0.043634
C  1.993194 2.25605 -2.305537
C  -2.725324 -0.921172 0.281198
C  -3.538602 0.840676 -1.198461
C  4.004104 2.565395 -0.956027
C  3.234683 2.896167 -2.095497
C  -3.969273 -1.581702 0.181726
C  -4.778483 0.191324 -1.311983
C  3.292227 -4.760765 -0.179089
C  4.997531 -3.040674 -0.550181
C  -4.998531 -1.026365 -0.618797
C  0.778724 2.593569 2.424515
C  1.395832 3.972776 2.402754
C  -6.546911 -2.854526 -0.098134
H  -1.32358 2.108297 -0.546421
H  -1.110765 0.823704 1.854825
H  3.8479 -0.828366 0.929853
H  2.598804 -1.613224 1.945382
H  2.682875 -1.944369 -1.125821
H  1.680832 -2.832622 0.060222
H  4.120945 1.360807 0.851817
H  1.378732 2.507161 -3.176044
H  -1.934757 -1.361146 0.899966
H  -3.375009 1.78202 -1.737043
H  4.962367 3.063816 -0.773141
H  3.591367 3.646986 -2.808273
H  -4.118979 -2.518643 0.726332
H  -5.587921 0.602966 -1.922091
H  2.387379 -4.998959 0.406387
H  4.0869 -5.469233 0.118856
H  3.063944 -4.937833 -1.260718
H  5.326893 -2.027243 -0.259373
H  5.784227 -3.750996 -0.237755
H  4.927708 -3.068012 -1.667733
H  0.640159 4.72453 2.116513
H  1.803097 4.21334 3.395176
H  2.198926 4.010631 1.645806
H  -7.579744 -3.112229 -0.374462
H  -5.859753 -3.656823 -0.429841
H  -6.473094 -2.733063 0.99999
