program: Gaussian 09
title: 000032921
version: EM64L-G09RevD.01
frameworkgroup: C1[X(C6H7F3N4OS)]
method: RPBEPBE
basis: SDD
operation: Freq
keyword: #p
keyword: freq=noraman
keyword: PBEPBE/SDD
title: #p freq=noraman PBEPBE/SDD
converged: YES YES NO NO
title: Mulliken charges:
elementType: S F F F O N N N N C C C C C C H H H H H H H
charge: 0.325533 -0.124917 -0.156647 -0.156764 -0.281933 -0.163803 -0.381481 -0.202105 0.002476 -0.022770 -0.634878 0.286719 -0.194784 0.363198 -0.595788 0.247736 0.299007 0.247847 0.412777 0.260306 0.243945 0.226328
chargesum: 0.00000
title: Mulliken charges with hydrogens summed into heavy atoms:
elementType: S F F F O N N N N C C C C C C
charge: 0.325533 -0.124917 -0.156647 -0.156764 -0.281933 -0.163803 0.031296 -0.202105 0.002476 -0.022770 0.159712 0.286719 -0.194784 0.363198 0.134791
polarizability: 1.79999743e+02 7.35339651e-02 1.21690376e+02 -5.31436116e-01 -5.07028420e-01 6.18482233e+01
1716.lowfreq: -33.1299 -12.5213 0.0015 0.0017 0.0021 1.8290 4.6568 5.9641 48.9281
frequency: -32.9739 -12.3039 48.9221 71.9734 96.3684 98.1418 155.6196 168.0207 187.1245 200.3540 238.0853 258.2224 291.7146 326.7131 336.0085 384.7745 388.5274 424.9068 482.9751 484.9308 538.4626 589.2035 601.3577 618.4245 638.6471 678.7847 701.2521 745.0084 846.6875 857.9772 927.2356 974.7059 1002.7445 1030.9883 1072.4742 1082.0293 1121.5598 1127.2120 1148.8141 1171.2565 1219.6813 1235.0490 1272.5903 1403.9620 1432.6208 1456.7117 1462.5269 1469.2090 1489.0997 1492.8630 1519.9906 1572.2032 1681.4975 2985.7304 2989.2941 3074.3670 3078.1343 3116.7421 3124.1721 3202.3516
redmass: 1.0281 12.2004 9.2576 8.2570 7.3791 5.9428 3.9947 5.5498 1.1206 5.0282 7.1300 5.4126 6.0153 7.0815 13.6138 4.3061 12.8341 10.2002 12.7592 14.8605 7.2362 11.2904 13.3381 9.9108 15.6320 8.4729 10.3778 6.0243 3.5610 1.1546 12.9656 13.0240 6.0395 8.1857 4.6821 3.4819 1.3054 1.2839 3.3045 2.6706 3.1695 3.4790 8.2148 1.3063 1.1617 8.0890 1.0896 1.0611 1.0512 1.0427 4.9751 1.4280 8.2618 1.0346 1.0372 1.1034 1.0971 1.1027 1.0984 1.0859
irintensity: 0.0473 0.2028 0.1126 3.3013 1.1204 8.0350 3.5074 11.2505 0.6282 0.0786 0.6773 3.7557 0.0387 19.3853 0.4956 9.5753 0.0558 12.8256 5.3089 0.7567 2.7393 0.0011 0.4615 27.4158 13.1931 3.5842 13.0155 1.4432 114.8158 107.0319 134.2417 260.7551 130.8147 88.9076 131.2380 60.1266 15.8371 1.1453 254.4912 114.2311 110.4502 55.9439 169.1794 42.1013 8.1861 273.1565 19.0560 19.1260 11.4476 23.7425 363.1615 393.8685 289.0719 27.6307 52.5679 15.7767 25.8195 14.1417 2.5993 386.7308
temp: 298.150 k
press: 1.00000 atm
elementType: 16 9 9 9 8 7 7 7 7 6 6 6 6 6 6 1 1 1 1 1 1 1
symmnumber: 1
zpe: 373217.0 jmol-1
zpe.correction: 0.142151 hartree
zpe.thermalcorrener: 0.155718 hartree
zpe.thermalcorrenthalpy: 0.156662 hartree
zpe.thermalcorrgfe: 0.101149 hartree
zpe.sumelectzpe: -1223.504466 hartree
zpe.sumelectthermal: -1223.490899 hartree
zpe.sumelectthermalent: -1223.489955 hartree
zpe.sumelectthermalfe: -1223.545468 hartree
dipole: -2.2823 1.2824 -0.0050
dipole: 2.6179
quadrupole: -111.9942 -87.2800 -93.9750
quadrupole: 9.7046 0.1039 0.0367
quadrupole: -14.2445 10.4697 3.7747 9.7046 0.1039 0.0367
hfenergy: -1223.646617 hartree
pointgroup: C01 [X(C6H7F3N4O1S1)]
dipole: 0.9166032 -0.4696099 -0.0114653 debye
dipolederiv: -0.3383139 -0.0356008 -0.0085869 -0.3065593 -0.2995195 -0.0242641 -0.0191205 -0.0205801 0.1551523 -0.5949457 0.2594311 0.0082626 0.274225 -0.6672717 -0.0171713 0.0083441 -0.0172083 -0.2623475 -0.7269397 -0.060072 -0.1800912 -0.1913121 -0.3390966 -0.1941032 -0.2618156 -0.1452065 -0.6470523 -0.7359017 -0.0824203 0.1694551 -0.2215699 -0.3757503 0.2148219 0.235479 0.1697078 -0.598118 -1.2104878 0.3079052 0.0057021 0.0899692 -0.7251746 -0.0187153 -0.0057653 -0.0124132 -0.3654647 -2.2236883 0.0036353 -0.0338507 -0.1305271 -0.6587702 -0.0241092 -0.036122 -0.0243079 -0.1690604 -0.7729429 -0.0960925 -0.0193891 -0.3221734 -1.0420702 -0.0554478 -0.0044783 0.0144075 -0.4360154 -1.0480328 -0.1499133 -0.0158128 0.762636 -0.5239135 -0.0029543 0.0210774 -0.0149332 -0.1912983 0.6527104 0.070865 0.012273 0.1566554 -0.4077295 -0.0118808 0.0158036 -0.0136058 -0.0912011 1.7952343 -0.0708123 0.0226121 -0.7361169 0.5178453 0.005526 -0.011906 0.0174456 0.0846741 -0.0396893 -0.0571953 -0.0056643 -0.1129415 0.4121649 0.0088478 -0.0083093 0.0077749 0.2063516 2.1959003 -0.0907722 0.0216765 0.7850873 1.4885965 0.0777443 0.0618824 0.0588617 0.2889095 -0.7693628 -0.096221 -0.0114363 -0.4347374 0.5526039 0.028433 -0.023505 0.0326534 -0.2023199 2.5431037 -0.1591227 0.0062518 0.1061319 1.3059299 -0.0110059 0.0199458 -0.0149453 1.5901741 0.3545223 0.2433931 0.0597388 0.2102532 0.3554494 0.032745 0.0463669 -0.014808 0.2440281 0.0704251 -0.094418 0.0915001 0.0117903 0.0024232 0.0230154 0.0704408 0.0495656 -0.0335026 0.057354 0.127855 0.0049202 0.0068668 0.2059262 0.0035111 -0.0005451 0.0042713 0.1420989 0.0739134 -0.08464 -0.0967961 0.018978 0.0083229 -0.0187943 -0.0658631 -0.0479878 -0.0442487 0.6795796 0.1397157 0.0097481 0.0336571 0.1825809 -0.0023301 0.0173624 -0.0101298 0.3183836 -0.025861 -0.0422904 0.0682141 0.0699071 0.0709425 -0.0750291 0.0815793 -0.023732 0.0392236 0.0010706 -0.104568 -0.058456 -0.0518257 0.0385027 -0.0011613 -0.1106396 -0.0685982 -0.1205755 0.0623523 0.0713385 -0.0502711 -0.018394 -0.101992 0.062322 -0.0302116 0.0737683 0.0922085 unknown
polarizability: 179.8762117|2.2136117|121.611657|2.1039166|3.2393285|62.0504731 unknown
InChI: InChI=1S/C6H7F3N4OS/c1-10-4(14)13(2)5-12-11-3(15-5)6(7,8)9/h10H,1-2H3
charge 0 multiplicity 1
22 atoms
S  -0.988558 -1.501166 -0.055751
F  -3.945078 1.375512 0.04106
F  -3.922605 -0.536234 -1.189029
F  -3.953829 -0.651296 1.071608
O  4.115222 -0.706132 0.041846
N  1.76209 -0.922793 0.003104
N  2.815729 1.239373 0.110266
N  0.18666 0.912961 0.064706
N  -1.171709 1.1725 0.060741
C  0.49419 -0.409409 0.009549
C  1.944704 -2.390565 -0.060894
C  3.003397 -0.108454 0.055184
C  -1.916393 0.076659 0.003485
C  -3.410648 0.086897 -0.016776
C  3.970292 2.144844 0.171598
H  1.480678 -2.87765 0.815656
H  3.028223 -2.580008 -0.05563
H  1.504518 -2.796231 -0.989777
H  1.839544 1.598704 0.121627
H  4.788616 1.756048 -0.456318
H  4.352323 2.245272 1.204706
H  3.666236 3.138168 -0.195962
