program: Gaussian 09
title: 000032958
version: EM64L-G09RevD.01
frameworkgroup: C1[X(C21H22N2O)]
method: RPBEPBE
basis: SDD
operation: Freq
keyword: #p
keyword: freq=noraman
keyword: PBEPBE/SDD
title: #p freq=noraman PBEPBE/SDD
converged: YES YES NO NO
title: Mulliken charges:
elementType: O N N C C C C C C C C C C C C C C C C C C C C C H H H H H H H H H H H H H H H H H H H H H H
charge: -0.270667 -0.093839 0.015295 -0.362397 -0.361474 -0.438346 -0.445913 -0.374695 -0.273346 -0.194352 0.236666 0.240882 0.398644 0.407636 -0.412239 -0.411346 -0.364957 -0.334677 -0.416245 -0.419465 -0.244582 -0.255873 -0.246408 -0.246487 0.229357 0.176541 0.178261 0.222282 0.229483 0.206170 0.209601 0.227311 0.183600 0.232214 0.224067 0.216301 0.211483 0.210339 0.255195 0.255315 0.239225 0.239336 0.230536 0.230740 0.230131 0.230699
chargesum: 0.00000
title: Mulliken charges with hydrogens summed into heavy atoms:
elementType: O N N C C C C C C C C C C C C C C C C C C C C C
charge: -0.270667 -0.093839 0.015295 0.043501 0.039069 -0.002694 -0.009002 0.041119 0.167023 -0.194352 0.236666 0.240882 0.398644 0.407636 -0.200756 -0.201008 -0.109762 -0.079362 -0.177020 -0.180130 -0.014046 -0.025133 -0.016277 -0.015788
polarizability: 2.97621050e+02 3.06266167e+01 3.14188064e+02 -3.60109722e+01 8.71220933e+00 1.74680199e+02
1716.lowfreq: -34.1287 -6.1220 -3.1944 -0.0004 0.0003 0.0008 1.1758 18.6076 27.2807
frequency: -34.0479 18.4726 26.9708 31.8284 51.2013 68.0383 82.3581 93.3434 113.2921 130.4958 160.5299 175.0182 187.9698 211.0276 253.1983 264.2659 294.1020 326.0772 329.1678 344.1585 388.1758 403.3694 415.5377 450.4190 476.0427 485.0292 527.5515 538.8832 587.3133 599.3268 613.9044 635.0526 644.5446 670.7878 687.6662 714.3912 725.7295 750.4485 753.6562 774.5016 780.1313 802.0671 811.3311 812.9704 843.4217 852.2703 858.9238 872.5985 888.8034 897.4168 899.8636 939.1163 956.6320 958.2913 963.9381 968.7856 984.0779 988.6296 993.9100 999.3026 1040.4164 1051.3453 1061.6444 1073.2595 1088.7026 1094.7217 1098.5130 1115.7078 1140.9567 1146.9732 1164.6024 1173.2173 1176.7205 1181.1785 1184.8703 1193.1500 1205.4349 1229.1365 1229.6595 1238.5405 1248.6118 1257.7012 1269.3924 1286.9224 1291.6297 1296.8680 1308.1756 1327.1089 1333.7709 1348.7718 1380.0920 1385.8757 1391.8849 1409.9895 1418.2809 1455.8490 1463.8208 1468.5430 1473.7466 1478.6441 1479.5786 1487.0069 1487.9203 1496.3398 1517.3924 1567.4609 1569.5364 1602.4274 1605.0775 1640.0685 2831.3699 2840.1108 2855.6793 2997.6710 3011.4682 3023.5394 3033.9513 3035.7585 3044.3989 3067.1865 3072.9869 3087.0171 3092.6381 3113.5514 3120.8666 3121.8830 3136.1693 3136.5779 3153.8328 3156.4944 3169.0515 3175.9991
redmass: 1.6081 4.4944 3.2659 3.5433 4.6426 4.2045 3.5225 2.6381 3.3845 4.8882 4.6721 4.5178 3.2092 3.4197 4.9377 4.3759 4.7335 5.4474 2.1833 6.4518 3.3870 6.2238 4.3207 3.3609 4.1207 3.7906 5.5765 4.7953 3.1001 5.1302 3.5439 3.0059 4.7996 5.9426 5.6374 5.1527 1.5400 1.9487 1.5514 1.8313 2.1221 4.0364 1.1658 1.6205 2.8342 1.6993 2.6836 2.0795 1.7354 3.2421 2.6875 3.7563 1.5712 1.4997 2.1403 1.5454 1.3474 1.3425 1.3496 6.8998 2.6808 2.1797 2.9909 2.1921 2.2053 1.7906 2.3594 1.8362 1.9361 2.2323 2.0601 1.4816 1.1206 1.4015 1.2319 1.3402 1.3731 1.9853 1.7983 1.2086 1.4246 1.6176 1.1650 1.2302 1.3129 1.4914 1.2947 2.5659 1.4163 1.4404 9.6629 4.8352 1.5232 1.6625 2.0174 2.1999 1.0819 1.0823 2.6180 1.0901 1.0789 2.8118 1.1175 1.1008 6.3191 7.2464 7.0351 6.0306 6.0085 7.2248 1.0712 1.0721 1.0696 1.0573 1.0595 1.0664 1.0874 1.0866 1.0867 1.1048 1.1080 1.0838 1.1054 1.0941 1.0868 1.0868 1.0893 1.0897 1.0947 1.0964 1.0992 1.0971
irintensity: 0.0375 0.2293 0.3437 0.1178 0.5735 0.3277 0.1643 1.4767 0.8639 2.2112 0.4757 0.6400 2.2911 0.7210 2.0741 3.2161 3.6687 0.9411 7.5431 1.3818 1.5225 1.5537 8.3152 17.2079 3.8177 5.2580 8.3166 0.4386 0.1623 10.2741 1.5632 0.1785 10.2464 6.5460 4.5107 0.9022 15.1509 8.1911 3.3147 10.5091 78.8058 73.1453 4.9491 50.1406 42.2098 9.4943 6.3678 46.0091 7.1904 51.2002 1.4646 119.5973 14.6215 21.3955 27.1323 0.0773 3.8964 0.3060 2.2092 82.9023 1.7072 6.8604 22.0797 21.6580 0.7263 1.3574 1.4881 2.1355 16.2469 38.2408 6.5036 1.5176 0.7854 5.5779 0.3163 5.4713 6.0206 2.8059 17.6708 4.4368 0.1960 1.2588 8.3255 4.2698 4.5817 6.9580 10.0936 8.5505 5.2253 0.3785 7.1759 6.0097 1.7156 2.7876 10.0526 2.6942 2.8593 0.1548 4.6149 17.8965 3.0367 18.5529 9.4669 3.7293 0.8912 1.9843 0.7566 0.9251 3.0372 1.3841 64.7557 45.6555 189.8776 59.7590 20.2416 65.0835 13.8650 71.1993 13.9368 1.0987 43.4503 0.2528 74.0811 24.8354 2.8935 19.3073 5.4913 21.4574 31.7854 30.9818 22.4164 12.2081
temp: 298.150 k
press: 1.00000 atm
elementType: 8 7 7 6 6 6 6 6 6 6 6 6 6 6 6 6 6 6 6 6 6 6 6 6 1 1 1 1 1 1 1 1 1 1 1 1 1 1 1 1 1 1 1 1 1 1
symmnumber: 1
zpe: 992851.3 jmol-1
zpe.correction: 0.378157 hartree
zpe.thermalcorrener: 0.398352 hartree
zpe.thermalcorrenthalpy: 0.399296 hartree
zpe.thermalcorrgfe: 0.326824 hartree
zpe.sumelectzpe: -996.367155 hartree
zpe.sumelectthermal: -996.346960 hartree
zpe.sumelectthermalent: -996.346016 hartree
zpe.sumelectthermalfe: -996.418489 hartree
dipole: 0.5028 0.6847 -0.7697
dipole: 1.1463
quadrupole: -121.0765 -128.1509 -138.8542
quadrupole: 1.8863 -10.5176 3.4752
quadrupole: 8.2841 1.2096 -9.4937 1.8863 -10.5176 3.4752
hfenergy: -996.7453125 hartree
pointgroup: C01 [X(C21H22N2O1)]
dipole: -0.2123709 0.2528416 0.307203 debye
polarizability: 301.0677318|-31.2299796|310.2285983|-36.8587299|-9.5673117|175.1929831 unknown
InChI: InChI=1S/C21H22N2O/c1-3-9-19-17(7-1)11-12-18-8-2-4-10-20(18)21(19)22-24-16-15-23-13-5-6-14-23/h1-4,7-12H,5-6,13-16H2
charge 0 multiplicity 1
46 atoms
O  -1.126788 0.088794 0.161181
N  -4.770453 -0.508153 -0.377115
N  0.047501 -0.777308 0.090554
C  -5.944534 0.396033 -0.499622
C  -5.215873 -1.591422 0.540148
C  -7.141276 -0.576938 -0.636775
C  -6.676424 -1.880316 0.098789
C  -3.524539 0.179558 0.011172
C  -2.311196 -0.746378 -0.145906
C  1.197559 -0.117278 0.171362
C  2.380337 -1.032913 0.176184
C  1.355939 1.358071 0.344709
C  3.521976 -0.829429 -0.666467
C  2.245735 2.132442 -0.470003
C  3.714342 0.325189 -1.548194
C  3.165227 1.581273 -1.470639
C  2.316875 -2.19613 0.989661
C  0.567601 2.018135 1.326296
C  4.54068 -1.829846 -0.677511
C  2.258701 3.550811 -0.303308
C  3.345666 -3.158661 0.979616
C  0.632108 3.413466 1.504469
C  4.465844 -2.975612 0.133362
C  1.474163 4.189362 0.671639
H  -5.826831 1.067659 -1.368585
H  -6.069009 1.033882 0.414083
H  -5.192252 -1.25058 1.608512
H  -4.564677 -2.478655 0.454469
H  -7.340513 -0.789772 -1.700762
H  -8.060751 -0.150667 -0.199169
H  -7.313339 -2.119809 0.96817
H  -6.710862 -2.742328 -0.588703
H  -3.563892 0.56447 1.063252
H  -3.382475 1.05208 -0.652842
H  -2.243999 -1.126931 -1.180997
H  -2.336093 -1.601201 0.555238
H  4.466975 0.173979 -2.334768
H  3.53104 2.315612 -2.201991
H  1.434551 -2.33665 1.621015
H  -0.113302 1.424151 1.940936
H  5.406831 -1.685758 -1.334646
H  2.921308 4.145639 -0.943481
H  3.272084 -4.046777 1.616528
H  0.015608 3.895797 2.270687
H  5.269078 -3.720039 0.108964
H  1.515847 5.27805 0.785787
