program: Gaussian 09
title: 000032924
version: EM64L-G09RevD.01
frameworkgroup: C1[X(C7H17O2PS)]
method: RPBEPBE
basis: SDD
operation: Freq
keyword: #p
keyword: freq=noraman
keyword: PBEPBE/SDD
title: #p freq=noraman PBEPBE/SDD
converged: NO YES NO NO
title: Mulliken charges:
elementType: S P O O C C C C C C C H H H H H H H H H H H H H H H H H
charge: -0.302887 0.782891 -0.483654 -0.483680 -0.219591 -0.219447 -0.358047 -0.358151 -0.848767 -0.678493 -0.678496 0.228264 0.200297 0.200232 0.228329 0.216261 0.216158 0.216172 0.216264 0.282151 0.270844 0.270855 0.215401 0.226220 0.209629 0.209628 0.226225 0.215394
chargesum: 0.00000
title: Mulliken charges with hydrogens summed into heavy atoms:
elementType: S P O O C C C C C C C
charge: -0.302887 0.782891 -0.483654 -0.483680 0.208970 0.209115 0.074372 0.074285 -0.024918 -0.027243 -0.027249
polarizability: 1.40673397e+02 -7.26474127e-04 1.17232256e+02 -1.39959329e-02 4.76649216e-01 1.22608407e+02
1716.lowfreq: -31.1816 -20.2239 -13.5859 -3.3831 0.0019 0.0022 0.0024 5.4381 33.1618
frequency: -30.7664 -18.6237 33.0902 41.2909 72.4326 86.4743 135.1887 142.4934 153.6637 190.2361 201.4206 208.5596 211.2825 212.5821 233.7299 256.9394 352.4091 365.3531 387.1266 415.7999 507.2808 672.2579 687.9894 756.6859 763.2057 763.7765 883.1081 884.8257 889.6440 893.5376 949.4677 960.3794 981.0288 982.2246 1047.4629 1047.8907 1125.8951 1127.7535 1144.6372 1145.4576 1229.7054 1229.9986 1280.6277 1282.2547 1303.5269 1303.6497 1345.9242 1363.3475 1367.0694 1393.4416 1393.5355 1433.1504 1436.7912 1470.2626 1472.4025 1477.3063 1478.0731 1478.5401 1478.5805 1488.7038 1489.2292 2961.4240 2963.9456 2979.1960 2979.3832 3003.5251 3003.6795 3024.8327 3025.6079 3030.5363 3054.8209 3054.9399 3082.0773 3082.3399 3083.0479 3083.1676 3153.5889 3160.3945
redmass: 2.8760 2.8046 2.3215 2.1916 2.6358 3.2317 3.4997 3.6853 1.0174 3.2031 4.1617 1.2357 1.1394 2.4695 3.8265 3.7663 6.3615 5.5153 3.8288 5.2842 7.5067 7.1658 7.0876 5.5255 1.0831 1.1371 1.2152 1.1669 1.8441 1.8455 3.0388 2.2357 1.6269 2.2603 2.8708 2.8608 2.0971 2.1053 1.5163 1.5256 1.2624 1.2600 1.0994 1.1017 1.3151 1.3164 1.1664 1.3919 1.3813 1.2053 1.2055 1.0439 1.0438 1.0722 1.0681 1.0608 1.0647 1.0417 1.0424 1.0829 1.0827 1.0556 1.0559 1.0359 1.0360 1.0599 1.0598 1.1058 1.1059 1.0313 1.1026 1.1026 1.1028 1.1028 1.0994 1.0994 1.1021 1.1027
irintensity: 0.1433 0.2866 0.3012 0.5411 0.8788 3.0580 1.6844 3.0715 0.0022 2.5379 11.5888 0.7750 0.7040 0.4084 7.9943 3.2730 16.5472 0.0865 4.8770 7.8357 30.7220 89.3304 146.6996 34.2750 2.0503 10.4191 6.8635 3.1136 5.6614 31.1367 351.2494 139.8986 1.5643 73.6910 5.5957 2.8805 3.1682 0.5400 1.1514 0.0974 1.0996 0.9203 1.0009 0.9483 0.1492 0.9546 19.2216 5.0109 2.9648 6.4664 21.0756 12.6906 9.2490 2.5553 3.8376 0.4222 4.0268 1.3995 23.9415 21.1447 14.2451 1.3839 57.5788 19.5128 59.9544 5.9811 46.6359 7.1371 14.8217 1.0392 0.4274 0.8397 28.7284 121.2446 45.1033 43.2951 1.5208 1.6184
temp: 298.150 k
press: 1.00000 atm
elementType: 16 15 8 8 6 6 6 6 6 6 6 1 1 1 1 1 1 1 1 1 1 1 1 1 1 1 1 1
symmnumber: 1
zpe: 615103.1 jmol-1
zpe.correction: 0.234280 hartree
zpe.thermalcorrener: 0.248868 hartree
zpe.thermalcorrenthalpy: 0.249813 hartree
zpe.thermalcorrgfe: 0.191442 hartree
zpe.sumelectzpe: -1165.756570 hartree
zpe.sumelectthermal: -1165.741982 hartree
zpe.sumelectthermalent: -1165.741038 hartree
zpe.sumelectthermalfe: -1165.799409 hartree
dipole: 0.0013 -1.3132 -1.7872
dipole: 2.2178
quadrupole: -76.4180 -78.2295 -91.4979
quadrupole: -0.0013 0.0086 -5.3863
quadrupole: 5.6305 3.8190 -9.4495 -0.0013 0.0086 -5.3863
hfenergy: -1165.9908508 hartree
pointgroup: C01 [X(C7H17O2P1S1)]
dipole: -0.0005856 -0.8625114 -0.1319378 debye
polarizability: 140.6734008|0.0111854|121.8452053|0.0004026|-1.9359185|117.9954536 unknown
InChI: InChI=1S/C7H17O2PS/c1-4-6-8-10(3,11)9-7-5-2/h4-7H2,1-3H3
charge 0 multiplicity 1
28 atoms
S  0.002372 2.457573 0.745318
P  0.000405 0.543397 1.560432
O  1.399663 -0.425177 1.163301
O  -1.401139 -0.422048 1.163736
C  2.08207 -0.254161 -0.144828
C  -2.082354 -0.250492 -0.144932
C  3.563386 -0.582393 0.064922
C  -3.563104 -0.582361 0.062984
C  0.00028 0.302737 3.389213
C  4.346494 -0.519435 -1.265873
C  -4.345444 -0.517839 -1.268187
H  1.943306 0.788499 -0.496826
H  1.619807 -0.950353 -0.87217
H  -1.617951 -0.94439 -0.873139
H  -1.945484 0.793025 -0.495089
H  3.987836 0.131048 0.795397
H  3.647345 -1.591661 0.509489
H  -3.645263 -1.592839 0.505121
H  -3.989526 0.128463 0.79486
H  -0.00143 -0.778626 3.594318
H  0.903283 0.768005 3.810025
H  -0.901099 0.770909 3.810286
H  4.286909 0.486792 -1.721088
H  5.41365 -0.752225 -1.102575
H  3.951975 -1.247354 -1.999537
H  -3.948746 -1.242962 -2.003443
H  -5.412169 -0.753513 -1.106221
H  -4.287873 0.489681 -1.720794
