program: Gaussian 09
title: 000032948
version: EM64L-G09RevD.01
frameworkgroup: C1[X(C14H23NO)]
method: RPBEPBE
basis: SDD
operation: Freq
keyword: #p
keyword: freq=noraman
keyword: PBEPBE/SDD
title: #p freq=noraman PBEPBE/SDD
converged: YES YES NO NO
title: Mulliken charges:
elementType: O N C C C C C C C C C C C C C C H H H H H H H H H H H H H H H H H H H H H H H
charge: -0.295777 -0.408097 -0.021722 -0.352928 -0.695699 -0.682652 0.244950 -0.475972 -0.461595 -0.400644 -0.121374 -0.118928 -0.229051 -0.132802 -0.168787 -0.731804 0.244714 0.180580 0.199815 0.237497 0.194486 0.214981 0.277765 0.210585 0.222415 0.221293 0.212433 0.208398 0.208125 0.206624 0.207840 0.220978 0.263944 0.215773 0.224380 0.213613 0.225899 0.220204 0.220541
chargesum: 0.00000
title: Mulliken charges with hydrogens summed into heavy atoms:
elementType: O N C C C C C C C C C C C C C C
charge: -0.295777 -0.130333 0.222992 0.027467 -0.048736 -0.028359 0.244950 -0.055142 -0.046846 -0.192804 0.099604 0.145015 -0.004671 0.082971 0.044826 -0.065159
polarizability: 2.70770799e+02 3.06242970e+01 1.53975401e+02 -1.35828692e+01 2.87546269e+00 1.37453797e+02
1716.lowfreq: -9.8669 -2.7706 -0.0004 0.0003 0.0006 3.7222 10.9771 11.7250 29.3482
frequency: -7.4972 11.6445 29.2403 34.7811 54.0439 72.8755 95.3818 102.6136 116.5295 150.2017 174.1598 186.5764 196.7778 204.9317 209.7657 236.6197 246.4849 252.1658 291.2726 315.4382 337.2952 380.6718 418.0403 430.4957 469.5375 472.3715 492.8855 531.6252 548.4070 685.2643 715.8240 754.9914 771.5984 798.2915 830.9642 840.7091 878.8573 901.2663 913.3647 937.4769 954.6813 965.9903 974.4416 975.7330 988.8030 1006.7378 1018.1391 1029.5884 1044.4425 1046.7778 1096.1812 1114.5287 1124.9265 1134.7324 1166.2806 1170.7882 1176.7741 1196.5351 1210.0443 1238.1156 1260.0289 1275.4550 1289.6113 1294.9232 1300.8842 1302.7711 1310.2502 1332.1592 1335.6385 1343.2733 1353.7746 1382.3665 1392.3729 1393.4082 1453.6917 1456.3961 1460.0184 1462.6137 1464.4443 1472.0406 1472.6149 1473.8519 1484.7904 1485.8980 1579.5508 1626.9719 1662.0230 1693.0847 2950.8730 2958.3053 2964.9927 2966.4882 2973.3573 2982.6710 3016.8278 3017.0547 3032.4811 3034.4626 3039.7391 3065.7381 3069.4721 3070.2927 3075.4322 3078.1280 3082.3094 3085.1852 3089.6453 3090.0668 3090.6437 3105.5072 3528.7705
redmass: 3.2703 4.3412 3.8061 5.0428 3.3581 2.3492 2.2501 2.3781 1.9986 2.7207 2.5561 2.1722 1.5093 1.2329 1.2309 2.3023 2.4887 3.6663 2.3203 3.3687 2.6584 2.7113 2.8670 2.4451 2.1187 2.6600 2.8917 3.0939 1.5050 3.8449 4.9499 1.4152 1.2913 1.7467 1.8223 1.8283 1.7575 2.1119 1.7297 1.9610 1.2353 1.8796 1.3095 1.2857 2.5285 1.6465 1.1280 1.6672 1.5350 3.3333 2.8171 2.4682 2.2726 1.6824 2.1917 2.2573 1.5595 1.1584 1.6389 1.3957 1.3343 1.3674 1.2500 1.3707 1.2777 1.2687 1.3443 1.3156 1.4239 1.5002 1.6048 1.2154 1.2131 1.2395 1.1070 1.2533 1.0997 1.0476 1.1332 1.0468 1.0572 1.0451 1.2579 1.1506 6.6093 6.0063 5.8446 6.2126 1.0616 1.0629 1.0375 1.0608 1.0374 1.0361 1.0984 1.0928 1.0971 1.0893 1.0971 1.0935 1.0976 1.0925 1.0932 1.0999 1.0997 1.0890 1.0938 1.0929 1.0998 1.0875 1.0768
irintensity: 1.0911 1.9626 2.6141 3.1556 0.4785 0.6093 0.7510 0.5877 0.1155 0.9308 1.4283 2.7077 0.9357 0.2599 0.5134 0.2337 5.7696 10.8748 0.8094 8.3569 0.3056 1.4958 2.5015 7.9993 12.4707 0.6014 0.6942 3.5602 93.2415 0.6080 5.6378 0.7140 15.3746 11.2105 0.4295 9.7025 12.3628 1.6703 4.6453 7.0482 9.8232 8.9609 88.1814 11.4625 12.1805 8.8745 73.4437 39.1622 0.2799 3.1725 1.2422 14.5590 8.5125 1.6122 6.3104 83.5946 44.3045 1.0437 21.4421 40.2963 77.0067 14.4820 3.0100 4.7922 3.7773 2.4961 19.2879 8.7435 13.9576 2.2491 45.6520 14.9402 14.2701 11.4655 48.2626 110.0396 15.6738 14.0879 72.3001 1.7048 13.8303 20.4310 120.0374 12.7138 160.3284 34.7077 113.2048 1.0014 19.9578 44.5398 51.1012 74.1407 44.5668 26.6786 7.7294 16.6035 31.7921 10.5636 29.5765 8.4009 37.4156 10.6653 7.1299 45.5768 62.4049 19.9566 65.7150 30.4743 42.1927 17.4923 19.0353
temp: 298.150 k
press: 1.00000 atm
elementType: 8 7 6 6 6 6 6 6 6 6 6 6 6 6 6 6 1 1 1 1 1 1 1 1 1 1 1 1 1 1 1 1 1 1 1 1 1 1 1
symmnumber: 1
zpe: 884692.5 jmol-1
zpe.correction: 0.336962 hartree
zpe.thermalcorrener: 0.356055 hartree
zpe.thermalcorrenthalpy: 0.356999 hartree
zpe.thermalcorrgfe: 0.286953 hartree
zpe.sumelectzpe: -675.977721 hartree
zpe.sumelectthermal: -675.958628 hartree
zpe.sumelectthermalent: -675.957684 hartree
zpe.sumelectthermalfe: -676.027729 hartree
dipole: -0.6968 -0.0650 -3.4993
dipole: 3.5686
quadrupole: -84.7044 -97.9162 -97.7012
quadrupole: 5.2101 -8.5094 0.0175
quadrupole: 8.7362 -4.4756 -4.2606 5.2101 -8.5094 0.0175
hfenergy: -676.3146823 hartree
pointgroup: C01 [X(C14H23N1O1)]
dipole: -0.2857361 0.0265837 -1.3743348 debye
polarizability: 270.832806|30.5946345|153.4568513|-13.5617024|3.2739582|137.9103393 unknown
InChI: InChI=1S/C14H23NO/c1-4-6-7-8-9-10-11-12-14(16)15-13(3)5-2/h4,6,9-13,15H,5,7-8H2,1-3H3
charge 0 multiplicity 1
39 atoms
O  2.187351 0.044279 1.496621
N  3.22311 0.389889 -0.5692
C  4.526651 0.804998 -0.013266
C  5.663259 -0.133302 -0.50037
C  4.816696 2.284737 -0.35663
C  5.484429 -1.598449 -0.052908
C  2.129964 0.041942 0.22221
C  -3.920332 -1.867828 -0.495766
C  -5.144976 -1.049238 0.026798
C  0.906529 -0.330779 -0.54177
C  -2.613016 -1.451986 0.131305
C  -0.243569 -0.698618 0.104662
C  -1.485818 -1.080124 -0.550494
C  -5.123819 0.40378 -0.40099
C  -5.143129 1.46808 0.442792
C  -5.122903 2.91953 0.018092
H  4.412704 0.699156 1.0816
H  5.729489 -0.077394 -1.608106
H  6.62252 0.264074 -0.113334
H  4.003482 2.935478 0.008744
H  4.914765 2.430054 -1.450333
H  5.761938 2.613044 0.113042
H  3.116546 0.388108 -1.58638
H  6.297663 -2.238015 -0.442064
H  4.523212 -2.007465 -0.412903
H  5.484084 -1.67706 1.049623
H  -4.109057 -2.938843 -0.26752
H  -3.858598 -1.782576 -1.598204
H  -6.063807 -1.538949 -0.35803
H  -5.187004 -1.115287 1.131784
H  0.943537 -0.305533 -1.640871
H  -2.58167 -1.454641 1.233089
H  -0.211836 -0.70255 1.204499
H  -5.087745 0.586203 -1.487617
H  -1.506855 -1.064659 -1.650961
H  -5.170799 1.278546 1.527765
H  -4.2379 3.44252 0.430402
H  -5.097222 3.017978 -1.081682
H  -6.015074 3.4598 0.390971
