program: Gaussian 09
title: 000033014
version: EM64L-G09RevD.01
frameworkgroup: C1[X(C20H25NS)]
method: RPBEPBE
basis: SDD
operation: Freq
keyword: #p
keyword: freq=noraman
keyword: PBEPBE/SDD
title: #p freq=noraman PBEPBE/SDD
converged: YES YES NO NO
title: Mulliken charges:
elementType: S N C C C C C C C C C C C C C C C C C C C C H H H H H H H H H H H H H H H H H H H H H H H H H
charge: 0.184072 -0.290978 -0.498615 -0.343891 0.380748 0.446601 -0.414149 0.509554 -0.366180 -0.665458 -0.671360 -0.387862 -0.423887 -0.376012 -0.346573 -0.418005 -0.252348 -0.259442 -0.240983 -0.244924 -0.249470 -0.626986 0.195764 0.210753 0.227415 0.199270 0.203726 0.230067 0.239237 0.251743 0.229673 0.203145 0.250107 0.240714 0.172276 0.207614 0.241885 0.240817 0.228513 0.226242 0.223674 0.222855 0.249998 0.227715 0.187195 0.220191 0.225556
chargesum: 0.00000
title: Mulliken charges with hydrogens summed into heavy atoms:
elementType: S N C C C C C C C C C C C C C C C C C C C C
charge: 0.184072 -0.040980 -0.498615 -0.343891 0.380748 0.446601 -0.007633 0.509554 0.060505 0.007573 0.013202 -0.137755 -0.183173 0.003878 -0.104688 -0.177188 -0.023835 -0.033200 -0.017309 -0.022069 -0.021754 0.005956
polarizability: 2.38180040e+02 2.23121634e+01 2.64128586e+02 -6.01170934e+00 3.27230844e-01 2.00394890e+02
1716.lowfreq: -6.6332 0.0019 0.0024 0.0025 6.6659 11.4500 27.9161 38.4149 48.6763
frequency: 27.8212 38.3679 48.6029 54.7264 62.6157 68.2567 93.4668 108.6956 127.6987 159.6035 165.2306 201.6367 222.2276 225.5833 229.5540 236.2960 239.3460 251.8012 271.4326 287.9919 293.4129 328.7879 350.0353 360.0663 398.1441 401.4094 410.6726 454.8562 476.2322 497.3663 523.9933 546.0768 578.5785 615.3718 617.5975 631.5570 648.2408 660.5072 701.2739 722.7186 754.3316 764.8328 770.0182 775.7510 806.5558 848.9152 866.9593 880.1837 896.3316 915.5251 928.0283 930.1928 951.7021 955.6794 976.7486 987.7230 990.1363 993.8759 1003.4298 1017.5599 1030.3194 1032.6592 1044.7147 1074.3912 1077.1543 1082.3114 1100.8491 1109.5350 1119.2187 1134.3495 1146.9977 1157.8991 1164.4261 1171.9146 1173.7613 1186.8523 1195.9342 1209.4130 1214.3294 1256.5186 1272.1068 1274.5860 1286.3508 1293.0933 1322.1727 1343.1169 1371.8712 1375.3123 1377.4466 1380.7872 1395.8781 1430.9360 1435.1448 1435.6264 1448.4901 1452.7177 1455.3456 1461.5777 1465.9578 1468.9212 1474.4595 1476.7366 1482.4595 1483.2381 1489.5170 1499.0956 1586.4130 1590.1146 1604.2078 1610.2576 2824.1206 2864.9324 2959.9093 2973.5797 2976.0566 2978.2218 2990.2072 3010.3603 3023.8507 3061.0475 3065.6913 3071.5209 3072.8099 3098.9434 3106.2677 3120.0940 3120.9259 3126.6417 3129.0437 3141.0082 3143.0118 3153.2230 3160.5565 3164.9829 3443.9644
redmass: 3.7357 4.1790 4.2372 3.2754 3.8251 1.9019 3.8907 3.2063 3.4975 2.8859 2.4047 3.9270 2.3777 1.2226 2.2553 1.6715 2.6311 1.7688 1.8231 2.6172 3.0334 3.2698 3.0817 3.3775 8.2031 2.9029 6.0280 3.8444 3.2853 3.7744 3.7785 3.3416 3.9733 4.4591 5.3241 5.0770 4.2713 1.3747 1.7034 2.3694 2.9460 2.3097 1.3905 1.7211 1.8834 1.2510 2.2268 1.5609 1.9555 2.7097 1.5197 1.5010 1.5203 1.9780 1.3879 1.3261 6.0450 1.3159 1.2878 4.1864 2.3845 2.3629 2.6175 2.4094 1.8051 1.7959 1.8048 1.7469 1.5960 1.7130 1.7230 3.8709 3.1930 1.0547 1.0638 3.0189 1.1409 1.6318 2.4820 1.9289 1.2870 1.9247 1.3920 1.1373 1.3588 1.4010 1.6877 5.7422 1.2147 5.9644 1.2020 2.1839 2.2029 1.1592 1.1992 1.0541 1.0946 1.0527 1.0769 1.2158 1.1855 1.2361 1.7608 1.5754 1.0649 1.0746 6.9140 6.4410 6.2932 6.0421 1.0714 1.0570 1.0609 1.0376 1.0687 1.0377 1.0801 1.0742 1.0956 1.1004 1.0970 1.0969 1.0994 1.0998 1.0989 1.0852 1.0843 1.0889 1.0878 1.0941 1.0929 1.0950 1.1005 1.1003 1.0745
irintensity: 0.0473 0.0504 0.3303 0.3440 0.1967 2.3729 0.5412 2.7763 1.1710 0.3624 0.4707 0.6942 0.9733 0.5334 0.9839 0.7884 0.8498 0.2227 0.2020 0.2324 0.0164 0.4126 6.8290 1.5140 0.9754 0.0345 1.0666 0.5931 12.0610 3.2968 6.5004 12.6319 6.7279 4.0294 1.8226 10.6154 5.9512 115.5758 52.2769 4.2941 6.8504 32.2093 61.3610 10.5326 2.4726 0.2647 3.5047 3.1591 2.4755 3.0688 0.6709 0.0701 0.6718 2.9587 0.0802 0.1301 0.2346 0.0211 0.2443 6.2177 11.9292 6.3919 8.4047 1.0476 8.2842 8.3443 3.0250 19.9375 3.9183 21.5266 13.9556 5.6556 26.9669 0.1549 0.4199 3.3321 2.8779 1.6455 5.9511 12.3182 14.0357 4.8999 4.6892 0.9886 1.5038 7.3788 5.8182 0.6542 24.0146 3.2104 14.3229 15.5849 4.3644 1.3691 23.0533 2.8875 5.7726 6.1515 8.0888 1.6567 3.2582 6.9377 16.5759 34.0607 18.7673 4.8777 3.6016 1.1817 0.9962 6.7639 87.3016 179.7842 33.3131 16.8261 6.0165 55.8741 44.4270 52.2772 14.9698 31.8858 1.5447 45.2194 40.9624 19.9431 22.1463 4.8417 2.3871 4.1969 3.6810 25.4558 29.9918 37.0684 30.1113 18.9453 1.3947
temp: 298.150 k
press: 1.00000 atm
elementType: 16 7 6 6 6 6 6 6 6 6 6 6 6 6 6 6 6 6 6 6 6 6 1 1 1 1 1 1 1 1 1 1 1 1 1 1 1 1 1 1 1 1 1 1 1 1 1
symmnumber: 1
zpe: 1039918.5 jmol-1
zpe.correction: 0.396084 hartree
zpe.thermalcorrener: 0.418284 hartree
zpe.thermalcorrenthalpy: 0.419228 hartree
zpe.thermalcorrgfe: 0.344497 hartree
zpe.sumelectzpe: -1228.310656 hartree
zpe.sumelectthermal: -1228.288456 hartree
zpe.sumelectthermalent: -1228.287512 hartree
zpe.sumelectthermalfe: -1228.362243 hartree
dipole: 0.3233 0.6385 2.3955
dipole: 2.5001
quadrupole: -136.9029 -124.6473 -141.0193
quadrupole: -0.5244 2.9541 -0.7987
quadrupole: -2.7131 9.5425 -6.8295 -0.5244 2.9541 -0.7987
hfenergy: -1228.70674 hartree
pointgroup: C01 [X(C20H25N1S1)]
dipole: 0.143676 0.3364764 0.9130546 debye
polarizability: 244.6195275|24.1630841|257.4881971|-7.9446936|-4.9199626|200.5957915 unknown
InChI: InChI=1S/C20H25NS/c1-19(2)17-12-7-8-13-18(17)20(22-19,14-9-15-21-3)16-10-5-4-6-11-16/h4-8,10-13,21H,9,14-15H2,1-3H3
charge 0 multiplicity 1
47 atoms
S  -0.109985 0.106367 -2.123891
N  4.57409 -1.813147 0.201907
C  -0.33313 -0.49434 -0.285257
C  0.412649 1.907884 -1.664899
C  -0.072876 0.771124 0.539624
C  0.319658 1.948561 -0.138838
C  0.727376 -1.594623 0.018339
C  -1.778946 -1.0030 -0.125054
C  2.196351 -1.134066 -0.036673
C  -0.585485 2.885265 -2.332878
C  1.853121 2.166053 -2.16947
C  -0.188444 0.773717 1.951218
C  0.603734 3.123233 0.601208
C  3.177133 -2.29238 0.229555
C  -2.846521 -0.066433 -0.063133
C  -2.099374 -2.383328 -0.060091
C  0.095735 1.944304 2.685421
C  0.495399 3.122399 2.008371
C  -4.183933 -0.490339 0.061897
C  -3.44195 -2.813076 0.061605
C  -4.490834 -1.871089 0.123563
C  5.58897 -2.860332 0.41518
H  0.508841 -2.007127 1.026359
H  0.592467 -2.423368 -0.703401
H  2.415157 -0.710553 -1.03366
H  2.367264 -0.3303 0.708282
H  -0.3225 3.932954 -2.088806
H  -0.55905 2.773877 -3.431603
H  -1.616521 2.692529 -1.992395
H  2.569751 1.468955 -1.704909
H  1.907645 2.04231 -3.265696
H  2.165029 3.200867 -1.92697
H  -0.5129 -0.136052 2.469525
H  0.90663 4.039145 0.080146
H  2.911636 -2.794492 1.198225
H  3.065856 -3.060793 -0.562663
H  -2.6196 1.004098 -0.116791
H  -1.308831 -3.138206 -0.104364
H  0.002944 1.94338 3.777158
H  0.714955 4.03376 2.575704
H  -4.988496 0.2525 0.108394
H  -3.664608 -3.885399 0.107341
H  4.705177 -1.011506 0.833547
H  -5.530524 -2.204147 0.217774
H  5.468548 -3.435187 1.367626
H  6.597502 -2.4097 0.411183
H  5.547091 -3.588598 -0.416507
