program: Gaussian 09
title: 000003034
version: EM64L-G09RevD.01
frameworkgroup: C1[X(C14H13Cl3N6O)]
method: RPBEPBE
basis: SDD
operation: Freq
keyword: #p
keyword: freq=noraman
keyword: PBEPBE/SDD
title: #p freq=noraman PBEPBE/SDD
converged: YES YES NO NO
title: Mulliken charges:
elementType: Cl Cl Cl O N N N N N N C C C C C C C C C C C C C C H H H H H H H H H H H H H
charge: -0.048463 -0.047103 -0.055849 -0.373323 -0.385351 -0.466474 0.082533 -0.067859 -0.626949 -0.612515 -0.607135 0.626404 -0.277169 -0.375851 0.561732 -0.212329 -0.229552 -0.074675 0.210282 -0.095060 0.145392 -0.760498 0.288753 -0.424036 0.232400 0.254794 0.380441 0.233545 0.360407 0.280503 0.259025 0.216432 0.221248 0.322074 0.393152 0.336097 0.334978
chargesum: 0.00000
title: Mulliken charges with hydrogens summed into heavy atoms:
elementType: Cl Cl Cl O N N N N N N C C C C C C C C C C C C C C
charge: -0.048463 -0.047103 -0.055849 -0.373323 -0.004910 -0.106067 0.082533 -0.067859 0.088277 0.058560 -0.119941 0.626404 -0.277169 -0.142306 0.561732 0.068173 0.029473 -0.074675 0.210282 -0.095060 0.145392 -0.322817 0.288753 -0.424036
polarizability: 3.56920907e+02 -2.14544976e+01 2.58999248e+02 1.54163140e+01 -1.72421068e+01 1.51458475e+02
1716.lowfreq: -11.2835 -2.2064 -0.0025 -0.0022 -0.0020 3.3379 10.2861 15.9514 26.6061
frequency: 9.9350 15.6898 26.4505 43.6287 56.3809 69.5729 94.7712 103.9431 127.5263 139.1860 164.8150 168.0659 183.5587 202.6444 231.5446 245.5399 258.2069 277.7995 309.4524 318.8361 348.0827 350.5785 360.0994 371.2121 405.3394 413.5042 433.7986 436.6284 468.0884 473.6737 507.8792 529.2600 530.4045 553.2725 560.2817 564.0566 587.7344 608.5600 624.5915 640.9970 658.7137 677.6494 694.8518 698.5434 712.6151 718.8250 730.5652 737.4808 760.5800 792.4133 800.9696 815.9655 835.7586 846.6882 864.6210 870.8249 935.6086 953.1750 976.5811 1010.3147 1022.5090 1038.8571 1085.1695 1109.5960 1141.8255 1156.4291 1162.1138 1199.6364 1239.8638 1241.5687 1277.6707 1296.6138 1317.2374 1341.5015 1375.8298 1376.1726 1383.3142 1422.5231 1435.4215 1447.9227 1463.8325 1468.9356 1475.2148 1513.0869 1535.9897 1546.2554 1571.3611 1587.0734 1589.6881 1596.7108 1623.2607 1655.5083 2982.2781 3048.7935 3135.0133 3148.4117 3177.4145 3183.5746 3262.0841 3355.4840 3384.1212 3467.5047 3536.9264 3634.9427 3690.4186
redmass: 9.7795 10.8853 11.7344 7.3209 5.5131 8.7791 6.3284 6.8510 7.8269 7.8099 6.2462 6.7134 13.1292 5.9697 6.8634 8.3592 6.5785 4.3771 3.8751 3.6555 6.8374 4.9294 7.8633 8.9163 7.0137 4.4072 3.8974 3.5040 3.8109 3.4040 1.1621 3.2034 1.3023 1.1876 4.0509 1.3548 6.3792 3.7701 3.8645 5.0691 5.4329 4.2936 7.5665 2.7645 1.7749 7.4707 2.6388 1.8863 2.3791 1.4653 2.1643 1.4109 2.7495 2.8247 1.4091 6.6599 1.7002 1.3878 2.1917 2.1385 3.9949 3.1820 2.7530 2.9540 1.4240 2.7837 2.6084 3.0784 3.1434 1.2901 1.2652 6.6396 2.0259 1.4086 3.3567 3.8303 4.4240 1.6481 2.9193 1.8498 2.4265 2.0469 2.5856 2.0913 1.8681 2.9662 7.5986 4.4876 6.0533 1.7847 1.8826 4.2821 1.0618 1.1003 1.0898 1.0625 1.0952 1.0937 1.1126 1.0582 1.0808 1.0767 1.0446 1.0937 1.1054
irintensity: 0.7167 0.0983 0.5674 1.8125 1.0086 0.3430 0.2004 0.6164 0.2453 6.9042 1.0126 1.4103 0.5485 6.0333 2.1857 1.9896 0.6206 13.7531 0.3300 14.7430 0.4650 30.6422 4.1989 4.7234 17.2488 6.4943 0.7930 2.3536 13.7476 72.2118 120.2791 2.6021 3.5102 9.0113 11.7016 298.9454 16.9637 2.3456 2.8136 2.4088 12.0742 25.7911 49.9395 34.4560 10.6166 8.5322 61.6457 69.2140 25.7241 33.5573 33.0852 271.7153 38.0570 29.8163 18.6948 54.3669 10.4832 0.2471 8.6812 2.5483 31.0899 116.6625 34.9157 11.0381 1.6563 5.8649 1.3345 16.4674 6.9627 7.9970 4.0627 182.0737 60.3665 59.0585 18.0857 5.9464 3.4171 160.5709 37.5144 47.6555 3.8436 92.5138 210.6858 632.2857 358.3799 90.5842 20.6011 419.0942 76.7682 192.3525 408.9186 204.7138 47.1052 5.6784 8.8672 0.0680 1.7827 0.7757 18.0407 224.4512 208.0572 57.4493 176.2918 103.4721 52.8927
temp: 298.150 k
press: 1.00000 atm
elementType: 17 17 17 8 7 7 7 7 7 7 6 6 6 6 6 6 6 6 6 6 6 6 6 6 1 1 1 1 1 1 1 1 1 1 1 1 1
symmnumber: 1
zpe: 691525.3 jmol-1
zpe.correction: 0.263388 hartree
zpe.thermalcorrener: 0.286168 hartree
zpe.thermalcorrenthalpy: 0.287112 hartree
zpe.thermalcorrgfe: 0.207798 hartree
zpe.sumelectzpe: -2323.517521 hartree
zpe.sumelectthermal: -2323.494741 hartree
zpe.sumelectthermalent: -2323.493797 hartree
zpe.sumelectthermalfe: -2323.573111 hartree
dipole: -4.0834 0.8996 0.2374
dipole: 4.1880
quadrupole: -129.7502 -155.1189 -160.4569
quadrupole: -9.7330 17.8341 -4.1895
quadrupole: 18.6918 -6.6769 -12.0149 -9.7330 17.8341 -4.1895
hfenergy: -2323.780909 hartree
pointgroup: C01 [X(C14H13Cl3N6O1)]
dipole: -1.5961573 0.161954 0.3754264 debye
polarizability: 356.0703236|-25.1485294|211.0742974|-10.6167345|56.9249116|200.23401 unknown
InChI: InChI=1S/C14H13Cl3N6O/c1-6(20-5-7-2-3-8(15)4-9(7)16)21-14(24)10-12(18)23-13(19)11(17)22-10/h2-4,20-21H,1,5,18-19H2
charge 0 multiplicity 1
37 atoms
Cl 3.225055 1.731309 1.459742
Cl 6.963923 0.987587 -2.560034
Cl -5.423134 -1.145102 -2.476559
O  -0.829283 0.703782 1.531664
N  1.26303 -0.916646 0.913807
N  -0.853586 -0.948544 -0.157189
N  -3.420288 -0.383257 -0.775277
N  -4.927444 1.594189 0.534377
N  -3.096471 2.118573 1.904461
N  -6.775126 1.090996 -0.822736
C  2.627102 -1.356108 1.187734
C  3.697603 -0.768741 0.261375
C  4.048834 0.601653 0.280021
C  4.402157 -1.590915 -0.653901
C  0.467897 -1.482144 -0.074294
C  5.02948 1.159214 -0.562606
C  5.394679 -1.078868 -1.518664
C  -2.841354 0.344181 0.231143
C  -1.435623 0.051597 0.590014
C  5.688642 0.295595 -1.458601
C  -3.622655 1.36214 0.899448
C  0.816947 -2.494357 -0.939532
C  -5.473683 0.853924 -0.46697
C  -4.670466 -0.152854 -1.119898
H  2.677713 -2.46108 1.133765
H  2.8597 -1.06749 2.229125
H  0.856463 -0.129182 1.43846
H  4.171187 -2.661973 -0.686636
H  -1.471108 -1.352397 -0.871976
H  5.273837 2.222977 -0.516801
H  5.921795 -1.731423 -2.219582
H  1.821814 -2.911785 -0.963501
H  0.090832 -2.89167 -1.651781
H  -3.679452 2.826161 2.347163
H  -2.116491 1.932352 2.165239
H  -7.291718 1.814118 -0.326343
H  -7.212309 0.553591 -1.568458
