program: Gaussian 09
title: 000030204
version: EM64L-G09RevD.01
frameworkgroup: C1[X(C26H22N2O)]
method: RPBEPBE
basis: SDD
operation: Freq
keyword: #p
keyword: freq=noraman
keyword: PBEPBE/SDD
title: #p freq=noraman PBEPBE/SDD
converged: YES YES NO NO
title: Mulliken charges:
elementType: O N N C C C C C C C C C C C C C C C C C C C C C C C C C C H H H H H H H H H H H H H H H H H H H H H H
charge: -0.220023 -0.147449 -0.134442 -0.388363 -0.577607 0.506646 0.108880 0.302967 0.435403 0.340530 -0.474640 -0.342392 -0.319870 -0.394351 -0.399408 -0.232355 -0.243163 -0.369094 -0.352184 -0.243883 -0.183916 -0.248214 -0.226549 -0.342852 -0.241564 -0.248085 -0.248313 -0.217048 -0.234609 0.251600 0.237493 0.255501 0.234843 0.283688 0.253984 0.319410 0.226542 0.227165 0.226275 0.261145 0.263384 0.228418 0.232609 0.229734 0.223630 0.237442 0.226717 0.229294 0.228906 0.229111 0.229059
chargesum: 0.00000
title: Mulliken charges with hydrogens summed into heavy atoms:
elementType: O N N C C C C C C C C C C C C C C C C C C C C C C C C C C
charge: -0.220023 -0.147449 -0.134442 -0.136764 -0.084613 0.506646 0.108880 0.302967 0.435403 0.340530 -0.239798 -0.058704 -0.065887 -0.074941 -0.172866 -0.005190 -0.016888 -0.107948 -0.088800 -0.015465 0.048694 -0.018480 -0.002919 -0.105410 -0.014846 -0.018791 -0.019406 0.012063 -0.005551
polarizability: 3.51343273e+02 -1.88414280e+00 3.01786388e+02 -6.04285158e+00 -1.15983010e+01 2.28906966e+02
1716.lowfreq: -6.5996 -2.9692 -0.0009 -0.0006 -0.0005 1.4742 13.7447 15.0447 33.9423
frequency: 12.8978 14.6400 33.9056 43.3278 46.8926 48.5351 59.3227 67.1246 85.5963 105.7253 118.0805 147.3320 167.1014 184.1689 200.5451 203.7438 237.1218 247.1050 290.3077 316.1613 337.6361 371.7610 395.0252 401.3295 405.0822 405.8609 417.1829 455.7469 481.1844 500.8952 521.2908 528.4552 558.6650 592.8556 613.6603 615.0793 617.5283 621.3625 626.9077 635.0847 682.7675 700.0789 705.6943 707.4015 731.4606 736.2125 756.9204 760.1219 767.5482 782.0371 792.0890 814.6867 851.9905 853.5727 855.3938 859.8048 862.7289 910.0634 924.9567 934.9218 944.1693 950.5184 956.6936 979.4282 980.8350 982.3567 985.2402 987.4127 989.1179 990.1599 998.7693 999.6402 1005.7827 1018.8195 1026.5252 1027.4405 1032.9075 1038.4709 1063.5002 1081.7953 1083.8268 1088.1659 1091.2930 1157.4292 1171.4984 1171.8510 1172.7564 1172.9067 1188.3577 1193.4794 1194.7859 1203.5311 1204.4388 1240.1960 1251.8306 1254.8435 1283.7220 1301.5558 1312.9031 1320.9635 1340.2020 1341.8768 1346.7942 1380.9438 1382.6971 1386.5901 1394.4623 1425.1876 1431.7077 1441.0802 1442.3503 1464.3637 1477.8905 1479.6353 1486.0858 1497.1712 1539.4949 1553.6502 1587.3912 1588.5378 1592.8646 1598.2408 1607.7157 1610.1173 1615.4463 2967.9555 2975.9124 3016.2620 3103.7541 3104.6769 3114.9001 3123.8811 3125.4233 3126.2663 3127.7419 3138.1139 3139.5917 3139.6317 3141.2662 3153.0134 3156.8531 3159.7975 3165.0395 3168.2862 3170.0087 3177.5888 3179.6225
redmass: 5.0523 5.0455 4.4110 4.9783 4.4543 4.5296 5.1230 4.0647 4.5734 5.5606 6.0650 4.8441 4.8157 4.9862 6.2245 5.2014 4.4518 4.7373 5.3245 2.7755 5.8152 6.7525 4.6125 2.8334 2.8822 2.8757 3.5709 2.7516 4.0713 4.9011 3.1120 5.5135 4.8427 4.8935 6.3044 6.4212 6.5040 6.0607 5.6603 6.2393 5.5658 1.7377 2.7651 1.6721 1.7502 1.4127 2.6338 2.3967 2.2735 2.9706 3.5622 3.7842 1.9986 1.5575 1.5930 1.2615 1.2725 1.5463 1.4534 1.4329 1.4077 2.5031 4.4132 1.3284 1.3897 1.3934 1.3518 6.1577 5.4424 5.8446 1.4801 1.4256 2.4909 1.6718 2.2672 2.0943 2.4112 2.1055 2.3548 1.6775 1.7244 1.6178 1.6840 2.4590 1.0647 1.0540 1.1195 1.0548 1.1139 1.1226 1.1274 2.6159 2.3912 3.2237 1.5742 1.3438 1.6503 1.4819 1.5742 1.3349 1.3246 6.9919 1.3024 7.9583 5.3916 5.5307 1.9739 2.0180 2.2780 2.1602 2.1264 1.3712 2.2146 2.2519 2.2301 2.2074 9.9254 5.8847 6.1805 5.9846 5.9720 5.9590 6.0094 6.0633 5.6546 1.0628 1.0802 1.0998 1.0879 1.0883 1.0908 1.0893 1.0851 1.0863 1.0894 1.0893 1.0902 1.0912 1.0949 1.0943 1.0969 1.1011 1.0973 1.0985 1.0937 1.0964 1.1001
irintensity: 0.4991 0.2252 0.4561 0.4022 0.3390 0.9197 1.1432 0.7159 1.1208 0.8725 1.0380 3.2652 2.8007 1.9431 1.5712 0.8308 2.0708 1.0160 0.8462 2.3283 2.5814 19.7228 1.3475 0.3087 0.9768 0.1363 5.6305 7.4667 5.2463 6.7068 7.3041 8.2839 23.4390 7.0542 0.7779 0.3921 0.8417 16.8938 16.4585 39.8883 1.2137 45.7252 12.8718 76.8870 28.3944 64.2610 19.8507 52.8080 48.8389 12.3454 8.8138 3.4880 3.9706 7.9055 8.0473 0.7754 1.0369 8.6697 0.6326 1.6109 0.2327 23.3509 16.3824 0.8188 0.2290 1.0221 0.7282 0.5299 0.9178 0.5184 3.2073 2.4560 21.3983 9.0407 11.0761 3.2077 8.0614 5.1438 11.6853 4.3012 5.0594 6.2511 7.2713 16.9413 1.0251 0.2317 11.7893 0.6084 4.2343 15.8944 4.5221 7.9192 13.6998 131.8207 75.0959 3.2405 24.5122 24.7906 25.6326 3.1537 4.2878 29.5783 5.6356 0.9754 2.2470 8.9233 5.3383 23.7031 9.0977 21.9161 17.0871 57.5564 6.3329 11.4319 22.1563 161.3296 158.7609 10.9968 11.8095 1.1846 65.6645 194.7588 8.4598 3.9221 9.5989 28.1997 10.5992 9.2123 11.0410 10.2177 35.2480 15.3117 0.3069 0.9255 8.2133 12.2768 19.0658 15.0437 23.9212 25.5387 23.1875 51.3038 18.3966 19.2182 20.6734 12.0323 15.1049
temp: 298.150 k
press: 1.00000 atm
elementType: 8 7 7 6 6 6 6 6 6 6 6 6 6 6 6 6 6 6 6 6 6 6 6 6 6 6 6 6 6 1 1 1 1 1 1 1 1 1 1 1 1 1 1 1 1 1 1 1 1 1 1
symmnumber: 1
zpe: 1067731.0 jmol-1
zpe.correction: 0.406677 hartree
zpe.thermalcorrener: 0.430787 hartree
zpe.thermalcorrenthalpy: 0.431731 hartree
zpe.thermalcorrgfe: 0.349482 hartree
zpe.sumelectzpe: -1186.677236 hartree
zpe.sumelectthermal: -1186.653126 hartree
zpe.sumelectthermalent: -1186.652182 hartree
zpe.sumelectthermalfe: -1186.734431 hartree
dipole: -0.6870 1.8014 2.0448
dipole: 2.8104
quadrupole: -149.3810 -154.1031 -167.3059
quadrupole: 2.1671 2.3175 -5.8646
quadrupole: 7.5490 2.8269 -10.3759 2.1671 2.3175 -5.8646
hfenergy: -1187.0839129 hartree
pointgroup: C01 [X(C26H22N2O1)]
dipole: 0.7359285 0.7012327 -0.4349976 debye
polarizability: 231.3219927|-21.4731216|338.666457|2.0610912|19.4307409|312.0481773 unknown
InChI: InChI=1S/C26H22N2O/c29-26(23-16-8-3-9-17-23)25(22-14-6-2-7-15-22)28(24-18-10-11-19-27-24)20-21-12-4-1-5-13-21/h1-19,25H,20H2
charge 0 multiplicity 1
51 atoms
O  -1.624536 -0.970391 1.101092
N  0.566887 -0.623232 -0.685818
N  1.169929 -0.112102 1.515146
C  -0.53099 0.382233 -0.579843
C  0.805398 -1.247235 -1.994028
C  -0.074111 1.767865 -1.036801
C  -1.253085 0.205937 0.806902
C  1.391469 -0.881723 0.401399
C  0.241829 -2.664625 -2.164917
C  -1.666094 1.347234 1.692397
C  -0.657924 2.330759 -2.200931
C  0.947574 2.492459 -0.367259
C  2.40643 -1.890307 0.387641
C  -0.693997 -3.207454 -1.251149
C  0.650257 -3.436547 -3.282667
C  -0.243924 3.593018 -2.685913
C  1.362255 3.751088 -0.850591
C  -2.014657 2.642192 1.228224
C  -1.801645 1.05403 3.078344
C  0.769298 4.308736 -2.009462
C  3.187429 -2.06815 1.542312
C  -1.214572 -4.506105 -1.461213
C  0.127892 -4.732029 -3.490904
C  1.926261 -0.311815 2.626352
C  -0.809414 -5.271635 -2.578189
C  -2.480083 3.622022 2.134407
C  -2.246716 2.036971 3.982237
C  2.95788 -1.27068 2.693462
C  -2.589185 3.32875 3.511869
H  -1.302715 0.039041 -1.300572
H  1.893341 -1.254092 -2.206072
H  0.362525 -0.582128 -2.760683
H  -1.447147 1.780166 -2.730356
H  1.394838 2.065409 0.534784
H  2.547488 -2.536465 -0.481631
H  -1.008687 -2.618505 -0.380484
H  1.379791 -3.02472 -3.993171
H  -0.707454 4.011777 -3.586304
H  2.146788 4.302764 -0.320217
H  -1.944284 2.890749 0.166672
H  -1.554174 0.043676 3.419807
H  1.094841 5.287157 -2.380427
H  3.96545 -2.839466 1.552035
H  -1.936707 -4.918029 -0.747006
H  0.452596 -5.319456 -4.357525
H  1.687882 0.32972 3.483227
H  -1.214421 -6.277821 -2.735312
H  -2.756088 4.614336 1.760978
H  -2.333945 1.799817 5.048438
H  3.546888 -1.3948 3.606025
H  -2.941961 4.094807 4.211792
