program: Gaussian 09
title: 000029953
version: EM64L-G09RevD.01
frameworkgroup: C1[X(C20H35NO3Si)]
method: RPBEPBE
basis: SDD
operation: Freq
keyword: #p
keyword: freq=noraman
keyword: PBEPBE/SDD
title: #p freq=noraman PBEPBE/SDD
converged: YES YES NO NO
title: Mulliken charges:
elementType: Si O O O N C C C C C C C C C C C C C C C C C C C C H H H H H H H H H H H H H H H H H H H H H H H H H H H H H H H H H H H
charge: 1.262112 -0.454847 -0.280674 -0.205549 -0.090300 -0.369079 0.249373 0.437539 -0.162731 -0.714710 -0.729630 -0.330477 -0.470554 0.228531 -0.330117 -0.320063 -1.008789 -1.004884 -1.038814 -0.260676 -0.382843 -0.311906 -0.385856 -0.696445 -0.684119 0.239012 0.252242 0.215782 0.201241 0.265718 0.215120 0.201677 0.291728 0.226836 0.232515 0.219207 0.242009 0.232871 0.230158 0.235343 0.238493 0.230015 0.238595 0.236112 0.241790 0.335647 0.224519 0.238978 0.200397 0.220793 0.185419 0.207102 0.221704 0.216605 0.231615 0.214000 0.212412 0.222551 0.220130 0.217174
chargesum: 0.00000
title: Mulliken charges with hydrogens summed into heavy atoms:
elementType: Si O O O N C C C C C C C C C C C C C C C C C C C C
charge: 1.262112 -0.119200 -0.280674 -0.205549 -0.090300 -0.130067 0.249373 0.437539 -0.162731 -0.045445 -0.047115 -0.038749 -0.243718 0.228531 -0.097602 -0.100857 -0.303751 -0.301033 -0.322318 0.202821 0.038347 0.080615 0.052453 -0.038419 -0.024264
polarizability: 3.41266918e+02 1.95400421e+01 2.26170807e+02 -3.70119048e+00 3.26855383e+00 2.33600919e+02
1716.lowfreq: -21.7635 -4.5685 -2.0288 0.0005 0.0010 0.0011 2.9722 10.5904 13.6081
frequency: -19.4807 10.4166 13.5618 21.5989 30.7975 41.6304 49.6243 54.7455 57.3507 75.3992 92.7906 94.4638 107.6138 119.0317 122.4246 136.9796 143.5561 147.0907 155.2535 170.5715 180.9408 191.5806 196.3091 203.0930 210.9162 218.5935 223.6116 227.9150 248.6087 267.9621 268.9357 276.8813 288.8143 306.6137 316.9555 324.6723 349.1104 363.5012 388.2584 396.6652 398.5254 406.1518 442.2668 484.8012 490.6588 517.2644 541.1819 601.3729 627.9577 648.4636 687.5149 691.9134 695.0996 711.6897 732.2239 737.6213 753.6154 772.2806 784.3831 789.6638 804.7895 805.7237 810.2663 825.8243 831.5574 857.1402 879.4083 896.4481 900.5443 901.5853 911.8018 912.9939 915.1755 931.3118 947.6788 960.2220 975.3166 978.4344 999.7986 1015.8879 1038.6900 1063.2912 1068.0287 1076.6609 1084.4743 1087.0068 1092.0157 1099.0803 1116.4119 1118.4493 1153.7813 1161.8235 1195.7490 1200.0329 1203.9812 1211.9209 1233.1585 1273.0656 1283.5139 1287.5734 1289.0461 1290.1945 1294.1046 1304.0016 1306.1336 1310.5343 1319.3440 1333.3728 1339.7672 1367.2061 1369.0662 1377.2320 1377.5151 1386.7693 1388.1363 1395.0228 1397.8363 1440.3316 1445.0254 1445.7866 1451.9937 1454.5894 1455.3254 1455.7694 1457.6849 1461.7018 1467.9188 1468.4841 1472.4580 1474.1951 1478.4905 1479.7205 1482.0165 1487.8764 1489.2157 1497.4552 1560.8954 1606.2214 1650.2753 2859.0511 2905.8128 2975.3354 2976.4239 2978.2924 2979.6709 2980.9862 2982.4936 2985.8365 2991.0162 3015.8750 3019.0537 3031.7004 3038.0483 3044.4462 3063.8821 3071.9635 3073.8801 3076.5461 3080.0225 3080.3784 3081.2049 3083.1100 3085.1252 3086.2770 3087.7354 3091.0322 3091.3225 3093.8202 3103.6308 3106.3060 3118.2589 3121.8243 3186.6555 3554.5089
redmass: 3.1109 4.4495 3.2680 3.6291 3.9862 3.7041 3.1356 2.9091 3.6768 3.2666 3.5562 3.5289 2.5264 1.1034 3.1643 1.1507 2.1350 1.1166 2.4714 2.2559 2.5048 2.4276 2.4104 1.3016 1.7415 2.3132 1.3206 1.4359 1.6902 1.6839 2.3093 2.8933 1.9878 4.2617 2.6288 3.6021 5.3238 3.7836 2.7191 2.7813 3.1168 2.9176 3.6235 2.8712 2.8275 3.0201 3.1213 4.0895 6.5217 5.7734 3.2698 5.7363 3.1219 4.8756 3.3641 1.1752 2.7933 1.1540 3.7560 1.1713 1.2827 1.3705 1.4753 2.4978 2.1391 1.3050 4.3402 2.0291 1.5103 1.5079 2.3460 1.5199 1.7924 2.7166 2.0093 1.8709 2.3788 1.4254 1.4613 3.4300 2.3931 2.0828 1.7707 3.3323 1.4797 2.0869 2.8714 3.7056 1.6768 1.5208 1.8216 1.3569 3.7752 1.3672 2.0598 1.6120 1.7573 1.1168 1.4519 1.2705 1.2108 1.2419 1.6279 1.2058 1.7473 1.6512 1.4140 1.3527 1.2314 2.8531 1.3807 1.2269 1.2221 1.3059 1.3533 1.6278 1.6030 1.0554 1.0548 1.0555 1.0531 1.0527 1.0500 1.0625 1.0540 1.0476 1.0564 1.0608 1.0534 1.0532 1.0613 1.0679 1.0553 1.0785 2.2499 1.0745 6.1822 6.0431 10.3091 1.0716 1.0698 1.0350 1.0379 1.0339 1.0341 1.0342 1.0376 1.0382 1.0588 1.0782 1.0667 1.0836 1.0992 1.0923 1.0980 1.0990 1.0975 1.1009 1.0985 1.0992 1.0983 1.0976 1.0985 1.0981 1.0981 1.1041 1.1043 1.0865 1.0987 1.0987 1.0935 1.0924 1.0941 1.0660
irintensity: 0.0405 0.1896 0.2156 0.3072 0.2953 0.2430 1.1857 0.3120 1.9237 0.7744 0.6970 0.2022 0.5077 0.0367 0.5438 0.2385 0.9692 0.1317 0.1316 0.8505 1.4233 1.7183 4.0280 7.9551 38.0648 2.1411 11.8826 70.6770 0.9465 0.7627 0.7438 9.9024 1.9047 16.0954 6.7943 9.6324 7.9301 1.8402 0.5045 0.6085 1.9220 3.4924 9.3514 13.8354 1.9267 9.9662 33.7622 8.5275 0.3010 7.9360 13.3183 6.4645 9.9195 11.5938 11.0794 0.2134 12.0102 7.1818 32.1736 2.9000 15.4915 5.7618 29.1139 2.6540 9.8521 1.2784 8.3628 9.0525 74.0672 68.4434 91.8817 105.4516 123.2173 15.5783 37.8368 19.4740 8.4757 0.5633 34.6506 0.1966 39.9398 50.5134 49.1418 387.6293 97.7786 0.9651 13.1781 54.8216 7.1219 15.0595 35.0831 9.9864 17.9549 10.0054 26.6548 10.0735 17.7638 1.1260 11.8331 32.4207 41.6748 17.3655 78.4744 21.0995 68.8810 14.0940 13.0403 6.4679 10.5386 11.6196 10.2630 23.2549 16.4080 18.3348 6.5615 29.8306 8.3583 0.1287 0.3704 1.2005 12.4517 1.8799 11.7315 7.6441 4.6871 15.7217 15.6922 6.9168 4.7215 2.0217 3.9758 28.4311 2.1865 17.5707 12.7965 1.3333 1.6327 4.7937 138.0806 90.5787 70.3493 28.0477 15.0042 18.6711 19.5944 13.2588 38.7795 24.7852 46.1721 26.0802 13.4556 8.4566 7.1933 16.7836 8.7271 50.1018 51.4063 67.0093 0.3460 47.1933 6.0806 56.3202 14.2668 22.1264 25.8907 56.1904 20.8302 15.8586 18.1695 21.7943 43.5763 1.2730 0.2193 3.9489
temp: 298.150 k
press: 1.00000 atm
elementType: 14 8 8 8 7 6 6 6 6 6 6 6 6 6 6 6 6 6 6 6 6 6 6 6 6 1 1 1 1 1 1 1 1 1 1 1 1 1 1 1 1 1 1 1 1 1 1 1 1 1 1 1 1 1 1 1 1 1 1 1
symmnumber: 1
zpe: 1335931.7 jmol-1
zpe.correction: 0.508830 hartree
zpe.thermalcorrener: 0.540441 hartree
zpe.thermalcorrenthalpy: 0.541385 hartree
zpe.thermalcorrgfe: 0.442707 hartree
zpe.sumelectzpe: -1350.968812 hartree
zpe.sumelectthermal: -1350.937201 hartree
zpe.sumelectthermalent: -1350.936256 hartree
zpe.sumelectthermalfe: -1351.034935 hartree
dipole: 1.9221 2.2331 -2.6892
dipole: 3.9891
quadrupole: -141.8209 -150.2453 -161.9468
quadrupole: 0.9281 -2.8578 3.0129
quadrupole: 9.5167 1.0924 -10.6091 0.9281 -2.8578 3.0129
hfenergy: -1351.4776418 hartree
pointgroup: C01 [X(C20H35N1O3Si1)]
dipole: 0.7126788 0.8192087 -1.1332047 debye
polarizability: 339.448386|23.6773266|228.4422799|-6.524288|3.3688091|233.1479788 unknown
InChI: InChI=1S/C20H35NO3Si/c1-8-21(9-2)14-15-24-19(22)18(20(3,4)23)16-10-12-17(13-11-16)25(5,6)7/h10-13,18,23H,8-9,14-15H2,1-7H3
charge 0 multiplicity 1
60 atoms
Si -5.950881 -1.569884 0.223732
O  -0.398534 2.826097 0.997347
O  2.030778 0.115135 -0.385727
O  0.722147 -0.022728 1.532317
N  5.537041 -1.111378 0.11376
C  -0.212255 0.967156 -0.568752
C  -0.18524 2.5404 -0.443287
C  -1.59122 0.349377 -0.341961
C  -4.202249 -0.808663 0.009098
C  1.182158 3.117657 -0.876767
C  -1.327149 3.166937 -1.273589
C  -2.232434 0.386573 0.922266
C  -2.260067 -0.279222 -1.42251
C  0.843741 0.318925 0.339107
C  -3.514812 -0.182271 1.085461
C  -3.542424 -0.8465 -1.250109
C  -5.933052 -3.378359 -0.410643
C  -7.21065 -0.55889 -0.810064
C  -6.449967 -1.527412 2.070619
C  3.153339 -0.520621 0.368513
C  4.350606 -0.571221 -0.590943
C  6.302701 -0.070061 0.844433
C  6.346741 -2.064853 -0.683289
C  7.267106 -0.648103 1.896453
C  7.129065 -1.467963 -1.885944
H  0.10377 0.756169 -1.606386
H  1.991169 2.743409 -0.228964
H  1.423102 2.845139 -1.920121
H  1.162512 4.222178 -0.808864
H  -2.308802 2.829338 -0.903622
H  -1.244916 2.894496 -2.341765
H  -1.282779 4.27134 -1.20498
H  -1.717758 0.857495 1.762765
H  -1.773348 -0.327227 -2.405726
H  -3.983213 -0.138913 2.07668
H  -4.026354 -1.326986 -2.111112
H  -5.241121 -3.998972 0.18726
H  -5.604948 -3.427575 -1.465566
H  -6.941821 -3.827313 -0.347395
H  -6.927183 -0.5472 -1.878779
H  -7.256496 0.488789 -0.460805
H  -8.224991 -0.99308 -0.730785
H  -7.444341 -1.990404 2.210082
H  -6.505771 -0.490652 2.450742
H  -5.727283 -2.084043 2.695118
H  -0.502663 3.805292 1.109457
H  3.360998 0.077898 1.273734
H  2.849355 -1.532272 0.68746
H  4.522656 0.445292 -1.016354
H  4.09509 -1.231889 -1.439362
H  6.867365 0.60069 0.148215
H  5.567583 0.574748 1.362181
H  7.055392 -2.569578 -0.001053
H  5.661016 -2.852399 -1.050197
H  6.722085 -1.316938 2.585624
H  8.090756 -1.222888 1.435705
H  7.722297 0.169612 2.484857
H  6.448433 -0.967659 -2.599594
H  7.883388 -0.729629 -1.55777
H  7.660031 -2.270796 -2.430801
